displayTitle,firstLine,textAuthNumber,hymnalTitle,hymnalID,number,textTitle,refrainFirstLine,authors,composers,meter,tuneTitle,tuneAuthNumber,incipit,languages,textSources,tuneSources
"He Giveth More Grace","He giveth more grace as our burdens grow greater",he_giveth_more_grace_as_our_burdens,"Yes, Lord!: Church of God in Christ hymnal",YL1982,100,"He Giveth More Grace","His love has no limit; His grace has no measure","Annie Johnson Flint","Hubert Mitchell",,"[He giveth more grace as our burdens grow greater]",he_giveth_more_grace_mitchell,53333335432454444456,English,,
"He Giveth More Grace","He giveth more grace when the burdens grow greater",he_giveth_more_grace_as_our_burdens,"The New Church Hymnal",NCH1976,61,"He Giveth More Grace","His love has no limit; His grace has no measure","Annie Johnson Flint","Hubert Mitchell",,"[He giveth more grace when the burdens grow greater]",he_giveth_more_grace_mitchell,53333335432454444456,English,,
"He Giveth More Grace","He giveth more grace as our burdens grow greater",he_giveth_more_grace_as_our_burdens,"Timeless Truths",TTvirt,196,"He Giveth More Grace",,"Annie J. Flint","Joel A. Erickson",12.11.12.11,SOLSTICE,solstice_erickson,55421357121556543132,,"Timeless Truths (http://library.timelesstruths.org/music/He_Giveth_More_Grace); http://www.blessedquietness.com/journal/homemake/ajf-grace.htm","Timeless Truths (http://library.timelesstruths.org/music/He_Giveth_More_Grace); http://www.blessedquietness.com/journal/homemake/ajf-grace.htm"
"He Giveth More Grace","He giveth more grace as our burdens grow greater",he_giveth_more_grace_as_our_burdens,"Favorites Number 7: A Collection of Gospel Songs",FAV71971,35,"He Giveth More Grace","His love has no limits, His grace has no measure","Annie Johnson Flint","Hubert Mitchell",,"[He giveth more grace as our burdens grow greater]",he_giveth_more_grace_mitchell,53333335432454444456,English,,
"He Giveth More Grace","He giveth more grace as our burdens grow greater",he_giveth_more_grace_as_our_burdens,"Songs from the Haven of Rest: and the crew of the Good Ship Grace",SHoR1971,47,"He Giveth More Grace","His love has no limits, His grace has no measure","Annie Johnson Flint",,,"[He giveth more grace as our burdens grow greater]",he_giveth_more_grace_mitchell,53333335432454444456,English,,
"He Giveth More Grace","He giveth more grace as our burdens grow greater",he_giveth_more_grace_as_our_burdens,"Praise! Our Songs and Hymns",POSH1979,360,"He Giveth More Grace","His love has no limits, His grace has no measure","Annie Johnson Flint","Hubert Mitchell",,"[He giveth more grace as our burdens grow greater]",he_giveth_more_grace_mitchell,53333335432454444456,,,
"He giveth more grace as our burdens grow greater","He giveth more grace as our burdens grow greater",he_giveth_more_grace_as_our_burdens,"The Song Book of the Salvation Army",SBSA1986,579,,,"Annie Johnson Flint (1866-1932)",,,,,,English,,
"He Giveth More Grace","He giveth more grace as our burdens grow greater",he_giveth_more_grace_as_our_burdens,"50 Favorites: and July 2013 index of supplement to Evening Light Songs",50F2013,16,"He Giveth More Grace",,"Annie J. Flint","Joel A. Erickson",,"SOLSTICE ",solstice_erickson,55421357U121D5565431,English,,
"He Giveth More Grace","He giveth more grace as our burdens grow greater",he_giveth_more_grace_as_our_burdens,"The Cyber Hymnal",CYBER,2375,"He Giveth More Grace",,"Annie J. Flint, 1866-1932","Ray Steadman-Allen",12.11.12.11,BLACKLANDS,blacklands_steadmanallen,,English,,
"He Giveth More Grace","He giveth more grace when the burdens grow greater",he_giveth_more_grace_as_our_burdens,"Sing Joyfully",SJ1989,311,"He Giveth More Grace","His love has no limit; His grace has no measure","Annie Johnson Flint","Hubert Mitchell",,"[He giveth more grace when the burdens grow greater]",he_giveth_more_grace_mitchell,53333335432454444456,English,,
"He Giveth More Grace","He giveth more grace when the burdens grow greater",he_giveth_more_grace_as_our_burdens,"His Fullness Songs",HFS1977,361,"He Giveth More Grace","His love has no limit, His grace has no measure","Annie Johnson Flint, 1866-1932","Hubert Mitchell",,"[He giveth more grace when the burdens grow greater]",he_giveth_more_grace_mitchell,53333335432454444456,English,,
"He Giveth More Grace","He giveth more grace when the burdens grow greater",he_giveth_more_grace_as_our_burdens,"Baptist Hymnal 2008",BH2008,113,"He Giveth More Grace","His love has no limit","Annie Johnson Flint","Hubert Mitchell",Irregular,"HE GIVETH MORE GRACE",he_giveth_more_grace_mitchell,53333335432454444456,English,,
"He Giveth More Grace","He giveth more grace when the burdens grow greater",he_giveth_more_grace_as_our_burdens,"The New National Baptist Hymnal (21st Century Edition)",NNBH2001,164,"He Giveth More Grace","His love has no limit","Annie Johnson Flint","Hubert Mitchell; Paul Mickelson",,"HE GIVETH MORE GRACE",he_giveth_more_grace_mitchell,53333335432454444456,English,,
"He Giveth More Grace","He giveth more grace when the burdens grow greater",he_giveth_more_grace_as_our_burdens,"The Celebration Hymnal: songs and hymns for worship",CEL1997,707,"He Giveth More Grace",,"Annie Johnson Flint","Hubert Mitchell",Irregular,"HE GIVETH MORE GRACE",he_giveth_more_grace_mitchell,53333335432454444456,English,,
"He giveth more grace when the [as our] burdens grow greater","He giveth more grace when the [as our] burdens grow greater",he_giveth_more_grace_as_our_burdens,"Gospel Quintet Songs",GQS1930,d47,,,"Annie Johnson Flint",,,,,,English,,
"He giveth more grace as our burdens grow greater","He giveth more grace as our burdens grow greater",he_giveth_more_grace_as_our_burdens,"The Song Book of the Salvation Army",SBSA1953,520,,,"Annie Johnson Flint",,,,,,English,,
"He Giveth More Grace","He giveth more grace when the burdens grow greater",he_giveth_more_grace_as_our_burdens,"The New National Baptist Hymnal",NNBH1977,148,"He Giveth More Grace","His love has no limit","Annie Johnson Flint","Hubert Mitchell; Paul Mickelson",,"[He giveth more grace when the burdens grow greater]",he_giveth_more_grace_mitchell,53333335432454444456,English,,
"He Giveth More Grace","He giveth more grace when the burden grows greater",he_giveth_more_grace_as_our_burdens,"The Hymnal for Worship and Celebration",HWC1986,415,"He Giveth More Grace","His love has no limit","Annie Johnson Flint","Hubert Mitchell",Irregular,"HE GIVETH MORE GRACE",he_giveth_more_grace_mitchell,53333335432454444456,,,
"He Giveth More Grace","He giveth more grace when the burdens",he_giveth_more_grace_as_our_burdens,"Hymns for the Family of God",HFFG1976,112,"He Giveth More Grace","His love has no limit","Annie Johnson Flint","Hubert Mitchell",,"HE GIVETH MORE GRACE",he_giveth_more_grace_mitchell,53333335432454444456,English,,
"He Giveth More Grace","He giveth more grace when the burdens grow greater",he_giveth_more_grace_as_our_burdens,"Rejoice Hymns",RH2011,125,"He Giveth More Grace","His love has no limit","Annie Johnson Flint, 1866-1932","Hubert Mitchell, 1914-","12.11.12.11 with refrain","HE GIVETH MORE PEACE",he_giveth_more_grace_mitchell,53333335432454444456,English,,
"He Giveth More Grace","He giveth more grace when the burdens grow greater",he_giveth_more_grace_as_our_burdens,"Redeeming Love",RL2021,169,"He Giveth More Grace","His love has no limit; His grace has no measure","Annie Johnson Flint","Hubert Mitchell",,"HE GIVETH MORE GRACE",he_giveth_more_grace_mitchell,53333335432454444456,English,,
"He Giveth More Grace","He giveth more grace when the burdens grow greater",he_giveth_more_grace_as_our_burdens,"Worship His Majesty",WHM1987,472,"He Giveth More Grace",,"Annie Johnson Flint","Hubert Mitchell",,"HE GIVETH MORE GRACE",he_giveth_more_grace_mitchell,53333335432454444456,,,
"He Giveth More Grace","He giveth more grace, when the burdens grow greater",he_giveth_more_grace_as_our_burdens,"Praise y Adoración: a bilingual hymnal : un himnario bilingüe",PyA2016,253a,"He Giveth More Grace","His love has no limit","Annie Johnson Flint, 1866-1932",,,,,,English,,
"He Giveth More Grace","He giveth more grace when the burdens grow greater",he_giveth_more_grace_as_our_burdens,"Hymns of Faith and Life",HoFL1976,382,"He Giveth More Grace","His love has no limit","Annie Johnson Flint",,"12.11.12.11 with refrain",,,,English,,
"His love has no limit","He giveth more grace when the [as our] burdens grow greater",he_giveth_more_grace_as_our_burdens,"The Christ We Forget and Twenty-One Other New Songs",CWFT1928,d3,,"His love has no limit","Annie Johnson Flint",,,,,,,,
"His love has no limit","He giveth more grace when the [as our] burdens grow greater",he_giveth_more_grace_as_our_burdens,"Special Songs for Special Singers Number 2",SSSS1958,d8,,"His love has no limit","Annie Johnson Flint",,,,,,,,
"His love has no limit","He giveth more grace when the [as our] burdens grow greater",he_giveth_more_grace_as_our_burdens,"Songs You Love No. 3",SYL31958,d9,,"His love has no limit","Annie Johnson Flint",,,,,,,,
"His love has no limit","He giveth more grace when the [as our] burdens grow greater",he_giveth_more_grace_as_our_burdens,"The Advent Christian Hymnal",ACH1967,d132,,"His love has no limit","Annie Johnson Flint",,,,,,,,
"His love has no limit","He giveth more grace when the [as our] burdens grow greater",he_giveth_more_grace_as_our_burdens,"Hymns of the Christian Life. Rev. ed.",HCLR1978,194,,"His love has no limit","Annie Johnson Flint",,,,,,English,,
"His love has no limit","He giveth more grace when the [as our] burdens grow greater",he_giveth_more_grace_as_our_burdens,"Hymns of the Christian Life: 1991 New International Version edition",HCL1992,194,,"His love has no limit","Annie Johnson Flint",,,,,,English,,
