displayTitle,firstLine,textAuthNumber,hymnalTitle,hymnalID,number,textTitle,refrainFirstLine,authors,composers,meter,tuneTitle,tuneAuthNumber,incipit,languages,textSources,tuneSources
"Praise the Lord","Praise the Lord! His works exalt him",priase_the_lord_his_works_exalt_him,"The Service of Praise",SoP1900,12,"Praise the Lord",,"Robert Walmsley","F. C. Maker",,"[Praise the Lord! His works exalt him]",morgenlied_maker,1115123166514322226,English,,
"Praise the Lord! his works exalt him","Praise the Lord! his works exalt him",priase_the_lord_his_works_exalt_him,"Worship and Song",WS1913,57,,,"R. Walmsley","Leonard Parker",,"[Praise the Lord! his works exalt him]",panoply_of_light_parker,15351321567123212,English,,
"Praise the Lord","Praise the Lord! His works exalt Him",priase_the_lord_his_works_exalt_him,"Heart and Voice: a collection of Songs and Services for the Sunday School and the Home",HV1910,40,"Praise the Lord",,"R. Walmsley","Leonard Parker",,"[Praise the Lord! His works exalt Him]",panoply_of_light_parker,15351321567123212,English,,
"Praise the Lord! his works exalt him","Praise the Lord! his works exalt him",priase_the_lord_his_works_exalt_him,"Worship and Song Edition B",WSEB1916,ad201,,,"R. Walmsley",,,,,,English,,
"Praise The Lord","Praise the Lord! His works exalt Him",priase_the_lord_his_works_exalt_him,"The Cyber Hymnal",CYBER,9960,"Praise The Lord",,"Robert Walmsley, 1831-1905","Frederick Charles Maker","8.7.8.7.8.7 D",MORGENLIED,morgenlied_maker,1115123166514322226,English,,
"Praise the Lord: O all ye people","Praise the Lord: His works exalt Him",priase_the_lord_his_works_exalt_him,"The Sunday School Hymnary: a twentieth century hymnal for young people (4th ed.)",SSH1905,177,,"Praise the Lord: O all ye people","Robert Walmsley","F. C. Maker",,MORGENLIED,morgenlied_maker,1115123166514322226,English,,
"A Hymn of Praise","Praise the Lord: His works exalt Him",priase_the_lord_his_works_exalt_him,"The Fellowship Hymn Book",FHB1908,264,"A Hymn of Praise",,"R. Walmsley","F. C. Maker",,MORGENLIED,morgenlied_maker,1115123166514322226,English,,
"A Hymn of Praise","Praise the Lord: His works exalt Him",priase_the_lord_his_works_exalt_him,"The Fellowship Hymn Book",FHB1909,264,"A Hymn of Praise",,"R. Walmsley",,,,,,English,,
"Praise the Lord","Praise the Lord, his works exalt",priase_the_lord_his_works_exalt_him,"Heart and Voice",HV1917,d214,,"Praise the Lord","Robert Walmsley",,,,,,English,,
