hymnalTitle,displayTitle,firstLine,textAuthNumber,hymnalID,number,textTitle,refrainFirstLine,authors,composers,meter,tuneTitle,tuneAuthNumber,incipit,languages,textSources,tuneSources
"A Baptist Hymn Book, Designed Especially for the Regular Baptist Church and All Lovers of Truth","From all that [who] dwell [dwells] below the [in earth and] skies","From all that [who] dwell [dwells] below the [in earth and] skies",from_all_that_dwell_below_the_skies,BHBD1844,d207,,,"Isaac Watts, 1674-1748",,,,,,English,,
"A Book of Hymns and Tunes: for the Sunday-School, the Congregation and Home: 2nd ed.","From all that dwell below the skies","From all that dwell below the skies",from_all_that_dwell_below_the_skies,BHTS1860,54,,,,,,,,,English,,
"A Book of Hymns for Public and Private Devotion (15th ed.)",Doxology,"From all that dwell below the skies",from_all_that_dwell_below_the_skies,BHPPD866,63,Doxology,,Watts,,8.8.8.8,,,,English,,
"A Book of Hymns for Public and Private Devotion. (10th ed.)","From all that dwell below the skies","From all that dwell below the skies",from_all_that_dwell_below_the_skies,BHPP1857,63,,,Watts,,,,,,English,,
"A Book of Song and Service: for Sunday school and home","From All That Dwell Below the Skies","From all that dwell below the skies",from_all_that_dwell_below_the_skies,BSSS1905,47,"From All That Dwell Below the Skies",,"Isaac Watts",,,"OLD HUNDRED",old_hundredth_bourgeois,117651233332143,English,,"The Genevan Psalter"
"A Choice Collection of Hymns and Spiritual Songs: intended for the edification of sincere Christians of all denominations","Universal Praise","From all who dwell below the Skies",from_all_that_dwell_below_the_skies,CCHS1774,XIX,"Universal Praise",,,,,,,,English,,
"A Choice Collection of Hymns, and Spiritual Songs, designed for the devotions of Israel, in prayer, conference, and camp-meetings...(2nd ed.)","From all that dwell below the skies","From all that dwell below the skies",from_all_that_dwell_below_the_skies,CCHS1831,146,,,,,,,,,English,,
"A Choice Selection of Evangelical Hymns, from various authors: for the use of the English Evangelical Lutheran Church in New York","From all that [who] dwell [dwells] below the [in earth and] skies","From all that [who] dwell [dwells] below the [in earth and] skies",from_all_that_dwell_below_the_skies,CSEH1806,320,,,"Isaac Watts, 1674-1748",,,,,,English,,
"A Choice Selection of Hymns. 2nd ed.","From all that [who] dwell [dwells] below the [in earth and] skies","From all that [who] dwell [dwells] below the [in earth and] skies",from_all_that_dwell_below_the_skies,CSH21833,d65,,,"Isaac Watts, 1674-1748",,,,,,English,,
"A Choice Selection of Hymns. 6th ed.","From all that [who] dwell [dwells] below the [in earth and] skies","From all that [who] dwell [dwells] below the [in earth and] skies",from_all_that_dwell_below_the_skies,CSH61843,d77,,,"Isaac Watts, 1674-1748",,,,,,English,,
"A Choice Selection of Psalms, Hymns and Spiritual Songs for the use of  Christians","From all that [who] dwell [dwells] below the [in earth and] skies","From all that [who] dwell [dwells] below the [in earth and] skies",from_all_that_dwell_below_the_skies,CSPH1819,488,,,"Isaac Watts, 1674-1748",,,,,,English,,
"A Collection of Choral Hymns for the ... Hanson Place Methodist Episcopal Congregation","From all that [who] dwell [dwells] below the [in earth and] skies","From all that [who] dwell [dwells] below the [in earth and] skies",from_all_that_dwell_below_the_skies,CCHH1874,d42,,,"Isaac Watts, 1674-1748",,,,,,English,,
"A Collection of Evangelical Hymns; made from Different Authors and Collections for the English Lutheran Church in New York","From all that [who] dwell [dwells] below the [in earth and] skies","From all that [who] dwell [dwells] below the [in earth and] skies",from_all_that_dwell_below_the_skies,CEHD1797,d69,,,"Isaac Watts, 1674-1748",,,,,,English,,
"A Collection of Familiar and Original Hymns and Tunes","From all that [who] dwell [dwells] below the [in earth and] skies","From all that [who] dwell [dwells] below the [in earth and] skies",from_all_that_dwell_below_the_skies,CFOH1899,d25,,,"Isaac Watts, 1674-1748",,,,,,English,,
"A Collection of Familiar and Original Hymns with New Meanings. 2nd ed.","From all that [who] dwell [dwells] below the [in earth and] skies","From all that [who] dwell [dwells] below the [in earth and] skies",from_all_that_dwell_below_the_skies,CFOH1891,27,,,"Isaac Watts, 1674-1748",,,,,,English,,
"A Collection of Hymns Adapted to the Use of the Methodist Episcopal Church","From all that [who] dwell [dwells] below the [in earth and] skies","From all that [who] dwell [dwells] below the [in earth and] skies",from_all_that_dwell_below_the_skies,CHAU1830,d155,,,"Isaac Watts, 1674-1748",,,,,,English,,
"A Collection of Hymns Adapted to the use of the Methodist Episcopal Church Including the Whole Collection of the Rev. J. Wesley","From all that [who] dwell [dwells] below the [in earth and] skies","From all that [who] dwell [dwells] below the [in earth and] skies",from_all_that_dwell_below_the_skies,CHAM1836,ad155,,,"Isaac Watts, 1674-1748",,,,,,English,,
"A Collection of Hymns and a Liturgy for the Use of Evangelical Lutheran Churches: to which are added prayers for families and individuals","From all that [who] dwell [dwells] below the [in earth and] skies","From all that [who] dwell [dwells] below the [in earth and] skies",from_all_that_dwell_below_the_skies,CHLU1817,6,,,"Isaac Watts, 1674-1748",,,,,,English,,
"A Collection of Hymns and a Liturgy: for the use of Evangelical Lutheran Churches, to which are added prayers for families and individuals (New and Enl. Stereotype Ed.)","From all that [who] dwell [dwells] below the [in earth and] skies","From all that [who] dwell [dwells] below the [in earth and] skies",from_all_that_dwell_below_the_skies,CHLE1827,6,,,"Isaac Watts, 1674-1748",,,,,,English,,
"A Collection of Hymns and A Liturgy: for the use of Evangelical Lutheran Churches; to which are added prayers for families and individuals","From all that dwell below the skies","From all that dwell below the skies",from_all_that_dwell_below_the_skies,CHAL1814,6,,,,,8.8.8.8,,,,English,,
"A Collection of Hymns and Sacred Songs: suited to both private and public devotions, and especially adapted to the wants and uses of the brethren of the Old German Baptist Church","From all that dwell below the skies","From all that dwell below the skies",from_all_that_dwell_below_the_skies,CHSS1882,89,,,,,,,,,English,,
"A Collection of Hymns and Spiritual Songs, Generally Used at Camp and Prayer Meetings","From all that [who] dwell [dwells] below the [in earth and] skies","From all that [who] dwell [dwells] below the [in earth and] skies",from_all_that_dwell_below_the_skies,CHSS1834,d61,,,"Isaac Watts, 1674-1748",,,,,,English,,
"A Collection of Hymns for Public and Private Devotion","From all that [who] dwell [dwells] below the [in earth and] skies","From all that [who] dwell [dwells] below the [in earth and] skies",from_all_that_dwell_below_the_skies,CHPP1879,d60,,,"Isaac Watts, 1674-1748",,,,,,English,,
"A Collection of Hymns for Public, Social and Domestic Worship","From all that [who] dwell [dwells] below the [in earth and] skies","From all that [who] dwell [dwells] below the [in earth and] skies",from_all_that_dwell_below_the_skies,CHPS1847,d220,,,"Isaac Watts, 1674-1748",,,,,,,,
"A Collection of Hymns for Public, Social and Domestic Worship","From all that [who] dwell [dwells] below the [in earth and] skies","From all that [who] dwell [dwells] below the [in earth and] skies",from_all_that_dwell_below_the_skies,CHPS1853,d222,,,"Isaac Watts, 1674-1748",,,,,,English,,
"A Collection of Hymns for Public, Social, and Domestic Worship","From all that [who] dwell [dwells] below the [in earth and] skies","From all that [who] dwell [dwells] below the [in earth and] skies",from_all_that_dwell_below_the_skies,CHPS1848,d221,,,"Isaac Watts, 1674-1748",,,,,,English,,
"A Collection of Hymns for Public, Social, and Domestic Worship","From all that [who] dwell [dwells] below the [in earth and] skies","From all that [who] dwell [dwells] below the [in earth and] skies",from_all_that_dwell_below_the_skies,CHPS1866,744,,,"Isaac Watts, 1674-1748",,,,,,English,,
"A Collection of Hymns for the Use of the African Methodist Episcopal      Church in America","From all that [who] dwell [dwells] below the [in earth and] skies","From all that [who] dwell [dwells] below the [in earth and] skies",from_all_that_dwell_below_the_skies,CHUA1839,d107,,,"Isaac Watts, 1674-1748",,,,,,English,,
"A Collection of Hymns for the use of the African Methodist Episcopal Zion Church in America","The creation invited to praise God","From all that dwell below the skies",from_all_that_dwell_below_the_skies,ACOH1872,11,"The creation invited to praise God",,,,8.8.8.8,,,,English,,
"A Collection of Hymns for the use of the Methodist Episcopal Church. Rev. with a Supplement","From all that [who] dwell [dwells] below the [in earth and] skies","From all that [who] dwell [dwells] below the [in earth and] skies",from_all_that_dwell_below_the_skies,CHME1844,d158,,,"Isaac Watts, 1674-1748",,,,,,English,,
"A Collection of Hymns for the Use of the Methodist Episcopal Church: principally from the collection of  Rev. John Wesley, M. A., late fellow of Lincoln College, Oxford; with... (Rev. & corr.)","From all that [who] dwell [dwells] below the [in earth and] skies","From all that [who] dwell [dwells] below the [in earth and] skies",from_all_that_dwell_below_the_skies,CHUM1836,268,,,"Isaac Watts, 1674-1748",,,,,,English,,
"A Collection of Hymns for the Use of the Methodist Episcopal Church: Principally from the Collection of the Rev. John Wesley. M. A.","From all that dwell below the skies","From all that dwell below the skies",from_all_that_dwell_below_the_skies,CHUM1821,268,,,,,,,,,English,,
"A Collection of Hymns for the Use of the United Brethren in Christ","From all that [who] dwell [dwells] below the [in earth and] skies","From all that [who] dwell [dwells] below the [in earth and] skies",from_all_that_dwell_below_the_skies,CHUU1837,d98,,,"Isaac Watts, 1674-1748",,,,,,English,,
"A Collection of Hymns for the use of the Wesleyan Methodist Connection of America","From all that [who] dwell [dwells] below the [in earth and] skies","From all that [who] dwell [dwells] below the [in earth and] skies",from_all_that_dwell_below_the_skies,CHWM1843,d143,,,"Isaac Watts, 1674-1748",,,,,,English,,
"A Collection of Hymns, for the Christian Church and Home","From all that dwell below the skies","From all that dwell below the skies",from_all_that_dwell_below_the_skies,CHCC1843,A1,,,Watts,,,,,,English,,
"A Collection of Hymns, for the Use of the People Called Methodists, with a Supplement","From all that dwell below the skies","From all that dwell below the skies",from_all_that_dwell_below_the_skies,CHUP1874,699,,,,,,,,,English,,
"A Collection of Hymns, for the Use of the Protestant Church of the United Brethren. New and  Revised ed.","From all that dwell below the skies","From all that dwell below the skies",from_all_that_dwell_below_the_skies,CHUP1832,901,,,,,,,,,English,,
"A Collection of Hymns, for the use of the United Brethren in Christ: taken from the most approved authors, and adapted to public and private worship","From all that dwell below the skies","From all that dwell below the skies",from_all_that_dwell_below_the_skies,CHUU1858,441,,,Watts,,,,,,English,,
"A Collection of Hymns, for the use of the Wesleyan Methodist Connection of America.","From all that dwell below the skies","From all that dwell below the skies",from_all_that_dwell_below_the_skies,CHWM1848,314,,,,,8.8.8.8,,,,English,,
"A Collection of Hymns: for camp meetings, revivals, &c., for the use of the Primitive Methodists","From all that dwell below the skies","From all that dwell below the skies",from_all_that_dwell_below_the_skies,CHCM1844,60,,,,,,,,,English,,
"A Collection of Hymns: for the use of the Methodist Episcopal Church, principally from the collection of the Rev. John Wesley, A. M., late fellow of Lincoln College..(Rev. and corr. with a supplement)","From all that dwell below the skies","From all that dwell below the skies",from_all_that_dwell_below_the_skies,CHUM1845,268,,,,,,,,,English,,
"A Collection of Psalms and Hymns for Christian Worship","From all that dwell below the skies","From all that dwell below the skies",from_all_that_dwell_below_the_skies,CPHC1830,65,,,Watts,,,,,,English,,
"A Collection of Psalms and Hymns for Christian Worship (10th ed.)","From all that dwell below the skies","From all that dwell below the skies",from_all_that_dwell_below_the_skies,CPHC1833,65,,,Watts,,8.8.8.8,,,,English,,
"A Collection of Psalms and Hymns for Christian Worship (6th ed.)","From all that dwell below the skies","From all that dwell below the skies",from_all_that_dwell_below_the_skies,CPHC1832,65,,,Watts,,8.8.8.8,,,,English,,
"A Collection of Psalms and Hymns for Christian Worship. (3rd ed.)","From all that dwell below the skies","From all that dwell below the skies",from_all_that_dwell_below_the_skies,CPHC1831,65,,,Watts,,,,,,English,,
"A Collection of Psalms and Hymns for Christian Worship. (45th ed.)","From all that [who] dwell [dwells] below the [in earth and] skies","From all that [who] dwell [dwells] below the [in earth and] skies",from_all_that_dwell_below_the_skies,CPHC1846,65,,,"Isaac Watts, 1674-1748",,,,,,English,,
"A Collection of Psalms and Hymns for Christian Worship. 16th ed.","From all that dwell below the skies","From all that dwell below the skies",from_all_that_dwell_below_the_skies,CPHC1835,65,,,Watts,,8.8.8.8,,,,English,,
"A Collection of Psalms and Hymns for Public Worship","From all that dwell below the skies","From all that dwell below the skies",from_all_that_dwell_below_the_skies,CPHP1805,LXXIV,,,,,,,,,English,,
"A Collection of Psalms and Hymns for Publick Worship","From all who dwell below the skies","From all who dwell below the skies",from_all_that_dwell_below_the_skies,CPHP1789,LXXIV,,,,,,,,,English,,
"A Collection of Psalms and Hymns for Publick Worship (2nd ed.)","From all that dwell below the skies","From all that dwell below the skies",from_all_that_dwell_below_the_skies,CPHP1813,DII,,,,,,,,,English,,
"A Collection of Psalms and Hymns for the Sanctuary","From all that dwell below the skies","From all that dwell below the skies",from_all_that_dwell_below_the_skies,CPH1845,96,,,Watts,,,,,,English,,
"A Collection of Psalms and Hymns for the use of Universalist Societies and Families (13th ed.)","From all that dwell below the skies","From all that dwell below the skies",from_all_that_dwell_below_the_skies,CPHU1842,71,,,Watts,,,,,,English,,
"A Collection of Psalms and Hymns for the Use of Universalist Societies and Families 16ed.  ","From all that dwell below the skies","From all that dwell below the skies",from_all_that_dwell_below_the_skies,CPHU1845,71,,,Watts,,8.8.8.8,,,,English,,
"A Collection of Psalms and Hymns, for Social and Private Worship","From all that dwell  below the skies","From all that dwell  below the skies",from_all_that_dwell_below_the_skies,CPHS1820,30,,,Watts,,,,,,English,,
"A Collection of Psalms and Hymns, for Social and Private Worship (Rev. ed.  with supplement)","From all that dwell  below the skies","From all that dwell  below the skies",from_all_that_dwell_below_the_skies,CPHS1845,30,,,Watts,,,,,,English,,
"A Collection of Psalms and Hymns: from various authors, chiefly designed for public worship (4th ed.)","From all that dwell below the skies","From all that dwell below the skies",from_all_that_dwell_below_the_skies,CPHF1811,35a,,,,,,,,,English,,
"A Collection of Psalms and Hymns: from Watts, Doddridge, and others (4th ed. with an appendix)","From all that dwell below the skies","From all that dwell below the skies",from_all_that_dwell_below_the_skies,CPHF1846,46,,,Watts,,,,,,English,,
"A Collection of Psalms and Hymns: suited to the various occasions of public worship and private devotion","From all that dwell  below the skies","From all that dwell  below the skies",from_all_that_dwell_below_the_skies,CPHS1884,30,,,,,,,,,English,,
"A Collection of Psalms, Hymns and Spiritual Songs; suited to the various kinds of Christian worship; and especially designed for and adapted to the Fraternity of the Brethren...","From all who dwell below the skies","From all who dwell below the skies",from_all_that_dwell_below_the_skies,CPHS1867,48,,,,,,,,,English,,
"A Collection of Psalms, Hymns, and  Spiritual Songs Suited to the Various Occasions of Public Worship. 2nd ed.","From all that [who] dwell [dwells] below the [in earth and] skies","From all that [who] dwell [dwells] below the [in earth and] skies",from_all_that_dwell_below_the_skies,CPHS1851,d103,,,"Isaac Watts, 1674-1748",,,,,,English,,
"A Collection of Psalms, Hymns, and Spiritual Songs","From all that [who] dwell [dwells] below the [in earth and] skies","From all that [who] dwell [dwells] below the [in earth and] skies",from_all_that_dwell_below_the_skies,CPHS1831,d85,,,"Isaac Watts, 1674-1748",,,,,,English,,
"A Collection of Psalms, Hymns, and Spiritual Songs: suited to the various occasions of public worship and private devotion of the church of Christ: with an appendix of  German hymns","From all that [who] dwell [dwells] below the [in earth and] skies","From all that [who] dwell [dwells] below the [in earth and] skies",from_all_that_dwell_below_the_skies,CPHS1864,30,,,"Isaac Watts, 1674-1748",,,,,,,,
"A Collection of Psalms, Hymns, and Spiritual Songs: suited to the various occasions of public worship and private devotion, of the church of Christ (6th ed.)","From all that [who] dwell [dwells] below the [in earth and] skies","From all that [who] dwell [dwells] below the [in earth and] skies",from_all_that_dwell_below_the_skies,CPHS1875,30,,,"Isaac Watts, 1674-1748",,,,,,,,
"A Collection of Sabbath School Hymns: compiled by a Sabbath School Teacher","From all That Dwell Below the Skies","From all that dwell below the skies",from_all_that_dwell_below_the_skies,CSSH1863,66,"From all That Dwell Below the Skies",,,,,,,,English,,
"A Collection of Sacred Hymns for the Church of Jesus Christ of Latter-Day  Saints","From all that dwell below the skies","From all that dwell below the skies",from_all_that_dwell_below_the_skies,CSHC1845,65,,,,,8.8.8.8,,,,English,,
"A Collection of Sacred Hymns, Adapted  to the Faith and Views of the Church of Jesus Christ of Latter Day Saints","From all that [who] dwell [dwells] below the [in earth and] skies","From all that [who] dwell [dwells] below the [in earth and] skies",from_all_that_dwell_below_the_skies,CSHA1849,d25,,,"Isaac Watts, 1674-1748",,,,,,English,,
"A Collection of Sacred Hymns, Adapted to the Faith and Views of the Church of Jesus Christ of Latter Day Saints","From all that [who] dwell [dwells] below the [in earth and] skies","From all that [who] dwell [dwells] below the [in earth and] skies",from_all_that_dwell_below_the_skies,CSHA1841,d29,,,"Isaac Watts, 1674-1748",,,,,,English,,
"A Collection of Sacred Hymns, for the Church of Jesus Christ of Latter Day Saints","From all that dwell below the skies","From all that dwell below the skies",from_all_that_dwell_below_the_skies,CSHC1841,32,,,,,8.8.8.8,,,,English,,
"A Collection of Sacred Song: being an eclectic compilation for the use of churches, families and schools... (2nd ed.)","From all that dwell below the skies","From all that dwell below the skies",from_all_that_dwell_below_the_skies,CSS21861,37(H103),,,,,,,,,English,,
"A Collection of Sacred Song: being an eclectic compilation for the use of churches, families, and boarding-schools...","From all that dwell below the skies","From all that dwell below the skies",from_all_that_dwell_below_the_skies,CoSS1859,37(H103),,,,,,,,,English,,
"A Collection of Spiritual Hymns: adapted to the Various Kinds of Christian Worship, and especially designed for the use of the Brethren in Christ. 2nd ed.","From all that [who] dwell [dwells] below the [in earth and] skies","From all that [who] dwell [dwells] below the [in earth and] skies",from_all_that_dwell_below_the_skies,CSHV1876,29,,,"Isaac Watts, 1674-1748",,,,,,English,,
"A Liturgy and Hymns for Church Sunday Schools","From all that dwell below the skies","From all that dwell below the skies",from_all_that_dwell_below_the_skies,LHCS1850,170,,,,,,,,,English,,
"A Liturgy for the New Church","From all that [who] dwell [dwells] below the [in earth and] skies","From all that [who] dwell [dwells] below the [in earth and] skies",from_all_that_dwell_below_the_skies,L4NC1878,d21,,,"Isaac Watts, 1674-1748",,,,,,English,,
"A Liturgy for the New Church. 3rd ed.","From all that [who] dwell [dwells] below the [in earth and] skies","From all that [who] dwell [dwells] below the [in earth and] skies",from_all_that_dwell_below_the_skies,LNC31878,d21,,,"Isaac Watts, 1674-1748",,,,,,English,,
"A Manual of Devotion and Hymns for the House of Refuge, City of New York","From all that [who] dwell [dwells] below the [in earth and] skies","From all that [who] dwell [dwells] below the [in earth and] skies",from_all_that_dwell_below_the_skies,MDHH1869,37,,,"Isaac Watts, 1674-1748",,,,,,English,,
"A Manual of Worship: for the chapel of Girard College","From all that dwell below the skies","From all that dwell below the skies",from_all_that_dwell_below_the_skies,MWCG1903,49,,,"Isaac Watts (1674-1748)",,,,,,English,,
"A Missionary Hymn Book","From all that dwell below the skies","From all that dwell below the skies",from_all_that_dwell_below_the_skies,MHB1922,12,,,"Isaac Watts (1674-1748)","S. Howard (1710-82)",,NORFOLK,norfolk_howard,512343212352176,English,,
"A New and Beautiful Collection of Select Hymns and Spiritual Songs","From all that [who] dwell [dwells] below the [in earth and] skies","From all that [who] dwell [dwells] below the [in earth and] skies",from_all_that_dwell_below_the_skies,NBCS1801,d92,,,"Isaac Watts, 1674-1748",,,,,,English,,
"A New Book of Hymns for the Use of the Methodist Episcopal and Other       Churches","From all that [who] dwell [dwells] below the [in earth and] skies","From all that [who] dwell [dwells] below the [in earth and] skies",from_all_that_dwell_below_the_skies,NBHU1879,d70,,,"Isaac Watts, 1674-1748",,,,,,English,,
"A New Selection of Psalms, Hymns and Spiritual Songs: from the best authors; designed for the use of conference meetings, private circles, and congregations (21st ed. with an appendix)","From all that [who] dwell [dwells] below the [in earth and] skies","From all that [who] dwell [dwells] below the [in earth and] skies",from_all_that_dwell_below_the_skies,NSPH1839,286,,,"Isaac Watts, 1674-1748",,,,,,English,,
"A Pastor's Selection of Hymns and Tunes: for Worship in the Church and Family","From all that dwell below the skies","From all that dwell below the skies",from_all_that_dwell_below_the_skies,PSHT1859,58,,,,,,,,,English,,
"A Pocket Hymn Book, Designed as a Constant Companion for the Pious,  Collected from Various Authors. 28th ed.","From all that dwell below the skies","From all that dwell below the skies",from_all_that_dwell_below_the_skies,PHBD1806,aCLVII,,,,,,,,,,,
"A Pocket hymn book, designed as a constant companion for the pious: collected from various authors","From all that dwell below the skies","From all that dwell below the skies",from_all_that_dwell_below_the_skies,PHBD1788,CLVII,,,,,,,,,English,,
"A Pocket Hymn Book: designed as a constant companion for the pious, collected from various authors (9th ed.)","From all that dwell below the skies","From all that dwell below the skies",from_all_that_dwell_below_the_skies,PHBD1791,CLVII,,,,,,,,,English,,
"A Pocket hymn-book, designed as a constant companion for the pious: collected from various authors (11th ed.)","From all that dwell below the skies","From all that dwell below the skies",from_all_that_dwell_below_the_skies,PHBD1790,CLVII,,,,,,,,,English,,