displayTitle,firstLine,textAuthNumber,hymnalTitle,hymnalID,number,textTitle,refrainFirstLine,authors,composers,meter,tuneTitle,tuneAuthNumber,incipit,languages,textSources,tuneSources
"O Thou from Whom all goodness flows","O Thou from Whom all goodness flows",o_thou_from_whom_all_goodness_flows,"The Hymnal, Revised and Enlarged, as adopted by the General Convention of the Protestant Episcopal Church in the United States of America in the year of our Lord 1892",HRGC1892,663,"O Thou from Whom all goodness flows",,"Rev. Thomas Haweis","J. I. T.",8.6.8.6,"[O Thou from Whom all goodness flows]",remembrance_tucker,531712344765433,English,,
"O Thou from Whom All Goodness Flows","O Thou, from whom all goodness flows",o_thou_from_whom_all_goodness_flows,"Hymns of the Christian Life. No. 3: for church worship, conventions, evangelistic services, prayer meetings, missionary meetings, revival services, rescue mission work and Sunday schools",HCL31904,258,"O Thou from Whom All Goodness Flows",,"T. Haweis","R. Simpson",,"[O Thou, from whom all goodness flows]",balerma_barthelemon,132165611323532,English,,
"O Thou, From Whom All Goodness Flows","O Thou, from whom all goodness flows",o_thou_from_whom_all_goodness_flows,"American Lutheran Hymnal",ALH1930,288,"O Thou, From Whom All Goodness Flows",,"Thomas Haweis","Richard Redhead",8.6.8.6,REDHEAD,redhead_no_66,3211566556717666,English,,
"O Thou from whom All Goodness Flows","O Thou from whom all goodness flows",o_thou_from_whom_all_goodness_flows,"The Lutheran Hymnal",LH1941,515,"O Thou from whom All Goodness Flows",,"Thomas Haweis",,8.6.8.6,"ST. BERNARD",st_bernard_tochter,51232143253644551656,English,,"""Tochter Zion,"" Cologne, 1741"
"O Thou from Whom All Goodness Flows","O Thou, from whom all goodness flows",o_thou_from_whom_all_goodness_flows,"The Cyber Hymnal",CYBER,5378,"O Thou from Whom All Goodness Flows",,"Thomas Haweis","John Bacchus Dykes",8.6.8.6,BEATITUDO,beatitudo_dykes,123531436713222,English,,"<cite>Hymns An­cient and Mo­dern</cite>, 1875 "
"O Thou from whom all goodness flows","O Thou from whom all goodness flows",o_thou_from_whom_all_goodness_flows,"The Book of Worship: prepared for the use of the New Church, by order of the general convention (New York ed.)",BOWP1876,48,,,,,,"[O Thou from whom all goodness flows]",o_thou_from_whom_all_goodness_flow_51335,513355444342171,,,
"O Thou from Whom all goodness flows","O Thou from Whom all goodness flows",o_thou_from_whom_all_goodness_flows,"The Westminster Abbey Hymn-Book: compiled under the authority of the dean of Westminster",WAHB1897,122b,,,"Thomas Haweis","O. A. King",,"[O Thou from Whom all goodness flows]",o_thou_from_whom_all_goodness_king,51235432161344555311,English,,
"O Thou from whom all goodness flows","O Thou from whom all goodness flows",o_thou_from_whom_all_goodness_flows,"International Song Service: with Bright Gems from fifty authors, for Sunday-schools, gospel meetings, missionary and young people's societies, prayer-meetings, etc.",ISS1895,266,,,"Rev. Thomas Haweis","Hugh Wilson, 1768",,"ALL GOODNESS FLOWS",martyrdom_wilson,51651232135321325321,English,,
"O Thou from Whom All Goodness Flows","O Thou from whom all goodness flows",o_thou_from_whom_all_goodness_flows,"The Friends' Hymnal, a Collection of Hymns and Tunes for the Public Worship of the Society",FHR1908,a315,"O Thou from Whom All Goodness Flows",,"T. Haweis",Rossini,,MANOAH,manoah_greatorex,12321776623432117532,English,,
"O Thou, from Whom all goodness flows","O Thou, from Whom all goodness flows",o_thou_from_whom_all_goodness_flows,"Prayer Book and Hymnal for the Sunday School",PBHS1885,21,,,,,,"[O Thou, from Whom all goodness flows]",ludwig_beethoven_55555,55555156677121555551,English,,
"Remember Me","O Thou, from whom all goodness flows",o_thou_from_whom_all_goodness_flows,"Y.M.C.A. Gospel Songs: New collection of sacred music arranged for male voices, and designed for use in Young Men's Christian Association meetings",YMGS1890,50,"Remember Me","O Thou, from whom all goodness flows",,"J. B. Herbert",,"[O Thou, from whom all goodness flows]",auld_lang_syne,511132123113566,English,,
"O thou from whom all goodness flows","O thou from whom all goodness flows",o_thou_from_whom_all_goodness_flows,"The Spirit of Praise: a collection of music with hymns for use in Sabbath-school services and church meetings",SoP1882,55,,,"Thomas Haweis","J. P. Jewson",,"[O thou from whom all goodness flows]",merton_jewson,12354323333432215433,English,,
"Dear Lord, Remember Me","O thou from whom all goodness flows",o_thou_from_whom_all_goodness_flows,"Wondrous Love: A Collection of Songs and Services for Sunday Schools",WL1885,77,"Dear Lord, Remember Me","Remember me!",Haweis,"G. F. Root",,"[O thou from whom all goodness flows]",o_thou_from_whom_all_goodness_root,33243321354653321324,,,
"O Thou from whom all goodness flows","O Thou from whom all goodness flows",o_thou_from_whom_all_goodness_flows,"The Church and Home Hymnal: containing hymns and tunes for church service, for prayer meetings, for Sunday schools, for praise service, for home circles, for young people, children and special occasio",CHHC1893,157a,,,"Thomas Haweis","F. J. Haydn",,"[O Thou from whom all goodness flows]",manoah_greatorex,12321776623432117532,English,,
"All Goodness Flows","O Thou, from Whom all goodness flows",o_thou_from_whom_all_goodness_flows,"Crowning Day No. 4",CD41900,254,"All Goodness Flows",,"Rev. Thomas Haweis","Hugh Wilson",,"[O Thou, from Whom all goodness flows]",martyrdom_wilson,51651232135321325321,English,,
"O Thou from Whom All Goodness Flows","O Thou from whom all goodness flows",o_thou_from_whom_all_goodness_flows,"Gloria Deo: a Collection of Hymns and Tunes for Public Worship in all Departments of the Church",GD1901,315,"O Thou from Whom All Goodness Flows",,"T. Haweis",Rossini,,MANOAH,manoah_greatorex,12321776623432117532,English,,
"O Thou, from Whom all goodness flows","O Thou, from Whom all goodness flows",o_thou_from_whom_all_goodness_flows,"Hymnal: according to the use of the Protestant Episcopal Church in the United States of America",HPEC1871,65,,,,,,,,,English,,
"O Thou, from whom all goodness flows","O Thou, from whom all goodness flows",o_thou_from_whom_all_goodness_flows,"Book of Worship (Rev. ed.)",BW1870,378,,,,,8.6.8.6,,,,English,,
"O Thou, from whom all goodness flows","O Thou, from whom all goodness flows",o_thou_from_whom_all_goodness_flows,"Evangelical Lutheran Hymnal. 9th ed.",ELH91895,a426,,,,,8.6.8.6,,,,English,,
"O Thou, from whom all goodness flows","O Thou, from whom all goodness flows",o_thou_from_whom_all_goodness_flows,"Christian Hymns: for church, school and home, with music",CHCS1898,94,,,,"G. Kirbye",8.6.8.6,WINDSOR,windsor_tye_daman,11232117354323354321,English,,
"O Thou, from whom all goodness flows","O Thou, from whom all goodness flows",o_thou_from_whom_all_goodness_flows,"Hymn Book: for the use of Evangelical Lutheran schools and congregations",HBUE1884,109,,,Haweis,,,,,,English,,
"O Thou, from whom all goodness flows","O Thou, from whom all goodness flows",o_thou_from_whom_all_goodness_flows,"The Church Hymnal: containing hymns approved and set forth by the general conventions of 1892 and 1916; together with hymns for the use of guilds and brotherhoods, and for special occasions (Rev. ed)",CHRC1920,342,,,"T. Haweis",Rossini,,MANOAH,manoah_greatorex,12321776623432117532,English,,
"O Thou, from whom all goodness flows","O Thou, from whom all goodness flows",o_thou_from_whom_all_goodness_flows,"Evangelical Lutheran Hymn-book",ELHL1892,358,,,,,8.6.8.6,,,,English,,
"O Thou from whom all goodness flows","O Thou from whom all goodness flows",o_thou_from_whom_all_goodness_flows,"Primitive Baptist Hymn and Tune Book",PBHT1918,386,,,"Rev. Thomas Haweis","Hugh Wilson",,"ALL GOODNESS FLOWS",martyrdom_wilson,51651232135321325321,English,,
"O Thou from whom all goodness flows","O Thou from whom all goodness flows",o_thou_from_whom_all_goodness_flows,"Primitive Baptist Hymn and Tune book",PBHT1907,386,,,"Rev. Thomas Haweis","Hugh Wilson",,"ALL GOODNESS FLOWS",martyrdom_wilson,51651232135321325321,English,,
"O Thou, from Whom all goodness flows","O Thou, from Whom all goodness flows",o_thou_from_whom_all_goodness_flows,"Common Service Book of the Lutheran Church",LHTC1918,394,,,"Thomas Haweis","Richard Redhead",,"REDHEAD, No. 66",redhead_no_66,3211566556717666,English,,
"O Thou, from whom all goodness flows","O Thou, from whom all goodness flows",o_thou_from_whom_all_goodness_flows,"Book of Worship with Hymns and Tunes ",BWHT1899,396,,,"Thomas Haweis","John B. Dykes",,BEATITUDO,beatitudo_dykes,123531436713222,English,,
"O Thou, from whom all goodness flows","O Thou, from whom all goodness flows",o_thou_from_whom_all_goodness_flows,"The Hymnal: as authorized and approved by the General Convention of the Protestant Episcopal Church in the United States of America in the year of our Lord 1916",EH1916,401a,,,"Thomas Haweis","Gioacchinno A. Rossini",8.6.8.6,MANOAH,manoah_greatorex,123217766234321,English,,
"O Thou, from whom all goodness flows","O Thou, from whom all goodness flows",o_thou_from_whom_all_goodness_flows,"The Hymnal: as authorized and approved by the General Convention of the Protestant Episcopal Church in the United States of America in the year of our Lord 1916",EH1916,401b,,,"Thomas Haweis","Edward Horsman",8.6.8.6,SILOAM,siloam_horsman,561431322511144,,,
"O Thou, from whom all goodness flows","O Thou, from whom all goodness flows",o_thou_from_whom_all_goodness_flows,"Evangelical Lutheran Hymnal",ELH1880,426,,,,,8.6.8.6,,,,English,,
"O Thou, from whom all goodness flows","O Thou, from whom all goodness flows",o_thou_from_whom_all_goodness_flows,"Evangelical Lutheran hymnal: with music",ELHW1908,426,,,"Thomas Haweis","James P. Jewson",,MERTON,merton_jewson,12354323333432215433,English,,
"O thou from whom all goodness flows","O thou from whom all goodness flows",o_thou_from_whom_all_goodness_flows,"Trinity Hymnal",TH1961,457,,,"Thomas Haweis","Hugh Wilson; Robert A. Smith",8.6.8.6,MARTYRDOM,martyrdom_wilson,51651232135321325321,English,"Alt. in Thomas Cotterill's <cite>Selections</cite>, 1819",
"O Thou, from whom all goodness flows","O Thou, from whom all goodness flows",o_thou_from_whom_all_goodness_flows,"Church Book: for the use of Evangelical Lutheran congregations",CBWM1872,490,,,"Thomas Haweis",,8.6.8.6,"CHRISTUS CONSOLATOR",christus_consolator_monk,327155433457655434,English,,
"O Thou, from whom all goodness flows","O Thou, from whom all goodness flows",o_thou_from_whom_all_goodness_flows,"Evangelical Lutheran Hymn-book",ELHL1918,497,,,,,8.6.8.6,,,,English,,
"O Thou from whom all goodness flows","O Thou from whom all goodness flows",o_thou_from_whom_all_goodness_flows,"The Hymnal: published by the Authority of the General Assembly of the Presbyterian Church in the U.S.A.",HAGA1895,721,,,"Rev. Thomas Haweis",,,,,,,,
Waite,"O Thou from whom all goodness flows",o_thou_from_whom_all_goodness_flows,"Kingdom of Song for the Sunday School",KSSS1900,13,Waite,,,"T. M. Bowdish",,"[O Thou from whom all goodness flows]",o_thou_from_whom_all_goodness_bowdish,55465171232176543255,English,,
"Dear Lord, Remember Me","Oh, Thou from whom all goodness flows",o_thou_from_whom_all_goodness_flows,"Gospel Melodies: a collection of sacred songs for use in Gospel Meetings, Social Gatheriing, &c., &c.",GM1884,36,"Dear Lord, Remember Me",,"T. Haweis","H. Wheeler",,"[Oh, Thou from whom all goodness flows]",o_thou_from_whom_all_goodness_wheeler,53161653556712343531,English,,
"Dear Lord, Remember Me","Oh, Thou from whom all goodness flows",o_thou_from_whom_all_goodness_flows,"Songs of Faith, Hope, and Love: for Sunday Schools and devotional meetings",SFHL1883,52,"Dear Lord, Remember Me",,"T. Haweis",,,"[Oh, Thou from whom all goodness flows]",o_thou_from_whom_all_goodness_flow_55332,5533217656713432666,English,,"Russian Melody"
"Dear Lord, Remember Me","O Thou from whom all goodness flows",o_thou_from_whom_all_goodness_flows,"Winnowed Songs for Sunday Schools",WSSS1890,83,"Dear Lord, Remember Me","Remember me, remember me","Thomas Haweis","Geo. F. Root",,"[O Thou from whom all goodness flows]",o_thou_from_whom_all_goodness_root,33243321354653321324,English,,
"Dear Lord, Remember Me","O Thou from whom all goodness flows",o_thou_from_whom_all_goodness_flows,"Salvation Songs: for gospel meetings, Endeavor Societies, Epworth Leagues, Baptist Unions, Sunday schools and prayer meetings",SSGM1895,90,"Dear Lord, Remember Me","Dear Lord, remember me","Thomas Haweis","Rev. J. S. Norris",,"[O Thou from whom all goodness flows]",o_thou_from_whom_all_goodness_norris,553515355765435535,English,,
"Remember Me","O Thou from whom all goodness flows",o_thou_from_whom_all_goodness_flows,"The Calvary Hymnal: for Sunday School, Prayer Meeting and Church Service",CHSS1891,105,"Remember Me",,"T. Haweis","F. A. J. Hervey",,"[O Thou from whom all goodness flows]",o_thou_from_whom_all_goodness_hervey,32343231111765567155,English,,
"Lord, Remember Me","O Thou from whom all goodness flows",o_thou_from_whom_all_goodness_flows,"Chapel Melodies",CM1868,135,"Lord, Remember Me","I know I'm weak, I know I'm vile",,"R. L.",,"[O Thou from whom all goodness flows]",o_thou_from_whom_all_goodness_flow_55111,551112345543111,English,,
"Remember Me","O Thou from whom all goodness flows",o_thou_from_whom_all_goodness_flows,"Windows of Heaven: hymns new and old for the church, sunday school and home (New ed.)",WoHN1894,156,"Remember Me","Remember me, remember me",,"R. G. Staples",,"[O Thou from whom all goodness flows]",o_thou_from_whom_all_goodness_staples,51231671551234223453,English,,
"Remember Me","O Thou from whom all goodness flows",o_thou_from_whom_all_goodness_flows,"Windows of Heaven: hymns new and old for the church, Sunday school and home used by Rev. H.M. Wharton in evangelistic work",WOH1889,156,"Remember Me","Remember me, remember me",,"R. G. Staples",,"[O Thou from whom all goodness flows]",o_thou_from_whom_all_goodness_staples,51231671551234223453,English,,
"O Thou from whom all goodness flows","O Thou from whom all goodness flows",o_thou_from_whom_all_goodness_flows,"Hymns, Selected from Various Authors, for the Use of  Young Persons         3rd Am. from 9th London ed.",HSVA1840,d179,,,"Thomas Haweis",,,,,,English,,
"O Thou, From Whom All Goodness","O Thou from whom all goodness flows",o_thou_from_whom_all_goodness_flows,"The New Century Hymnal",NCH1904,229,"O Thou, From Whom All Goodness",,"Rev. Thomas Haweis","Rev. John B. Dykes",,BEATITUDO,beatitudo_dykes,123531436713222,English,,
"O Thou from whom all goodness flows","O Thou from whom all goodness flows",o_thou_from_whom_all_goodness_flows,"Hymns selected from various authors: for the use of the Evangelical Association, and all lovers of pious devotion (5th ed.)",HUEA1850,261,,,"Thomas Haweis",,,,,,English,,
"O Thou from whom all goodness flows","O Thou from whom all goodness flows",o_thou_from_whom_all_goodness_flows,"The Cluster of Spiritual Songs, Divine Hymns and Sacred Poems: being chiefly a collection (3rd ed. rev.)",CSSD1829,CDLV,,,"Thomas Haweis",,,,,,,,
"O Thou from whom all goodness flows","O Thou from whom all goodness flows",o_thou_from_whom_all_goodness_flows,"The Psalms, Hymns and Spiritual Songs of the Rev. Isaac Watts, D. D.:  to which are added select hymns, from other authors; and directions for musical expression (New ed.)",PHS1834,D359,,,"Thomas Haweis",,,,,,,,
"O thou from whom all goodness flows","O thou from whom all goodness flows",o_thou_from_whom_all_goodness_flows,"Psalms and Hymns, for Christian Use and Worship",PHCU1845,H408,,,,,,,,,,,
"O thou from whom all goodness flows","O thou from whom all goodness flows",o_thou_from_whom_all_goodness_flows,"The Lecture-Room Hymn-Book: containing the psalms and hymns of the book of common prayer, together with a choice selection of additional hymns, and an appendix of chants and tunes...",LRHB1855,H246,,,,,,,,,,,
"O Thou from whom all goodness flows","O Thou from whom all goodness flows",o_thou_from_whom_all_goodness_flows,"Hymns for All Christians",H4AC1869,H76,,,"Rev. Thomas Haweis, M.D., 1732-1820",,,,,,English,,
"O thou, from whom all goodness flows","O thou, from whom all goodness flows",o_thou_from_whom_all_goodness_flows,"A Choice Selection of Hymns and Spiritual Songs: designed for the use of  the pious",CSHS1813,XVII,,,,,,,,,English,,
"O Thou, from whom all goodness flows","O Thou, from whom all goodness flows",o_thou_from_whom_all_goodness_flows,"In Excelsis: Hymns with Tunes for Christian Worship. 7th ed.",IEHT1900,a590,,,"T. Haweis; T. Cotterill",,,,,,English,,
"O Thou, from whom all goodness flows","O Thou, from whom all goodness flows",o_thou_from_whom_all_goodness_flows,"The Harp. 2nd ed.",H21860,a672,,,,,,,,,,,
"O Thou, from whom all goodness flows","O Thou, from whom all goodness flows",o_thou_from_whom_all_goodness_flows,"Plymouth Collection",PC1863,a820,,,Hawes,,,,,,,,
"O Thou from whom all goodness flows","O Thou from whom all goodness flows",o_thou_from_whom_all_goodness_flows,"Hymns of the ""Jubilee Harp""",HoJH1868,a260,,,,,,,,,English,,
"O Thou, from whom all goodness flows","O Thou, from whom all goodness flows",o_thou_from_whom_all_goodness_flows,"Hymn Book for Christian Worship. 8th ed.",HBCW1864,a598,,,"T. Humphries",,,,,,English,,
"O Thou from whom all goodness flows","O Thou from whom all goodness flows",o_thou_from_whom_all_goodness_flows,"Hymnal, Amore Dei. Rev. ed.",hadr1903,a100,,,"Rev. T. Haweis",,,,,,English,,
"O Thou from whom all goodness flows","O Thou from whom all goodness flows",o_thou_from_whom_all_goodness_flows,"The Union Harp",UH1861,4,,,,,,,,,,,
"O Thou, from Whom all goodness flows","O Thou, from Whom all goodness flows",o_thou_from_whom_all_goodness_flows,"Welsh and English Hymns and Anthems",WEHA1979,6b,,,"T. Haweis","Daniel Protheroe. (1866-1934)",,MILWAUKEE,milwaukee_protheroe,55321117655671432,English,,
"O Thou, from Whom all goodness flows","O Thou, from Whom all goodness flows",o_thou_from_whom_all_goodness_flows,"Welsh and English Hymns and Anthems (Reformatted)",WaEHaA_R,6b,,,"Thomas Haweis (1734-1820)","Daniel Protheroe (1866-1934)",,MILWAUKEE,milwaukee_protheroe,55321117655671432,English,,
"O Thou from whom all goodness flows","O Thou from whom all goodness flows",o_thou_from_whom_all_goodness_flows,"The Melodeon: a collection of hymns and tunes with original and selected music, adapted to all occiasions of social worship",M1860,9,,,"Thomas Haweis",,,,,,,,
"O Thou from whom all goodness flows","O Thou from whom all goodness flows",o_thou_from_whom_all_goodness_flows,"New Hymn and Tune book: an Offering of Praise for the Methodist Episcopal Church",NHTO1866,11e,,,,,,,,,English,,
"O thou,  from whom all goodness flows","O thou,  from whom all goodness flows",o_thou_from_whom_all_goodness_flows,"The Young Chorister; a collection of new and beautiful tunes, adapted to the use of Sabbath schools, from some of the most distinguished composers; together with many of the author's own compositions",YCCN1846,20b,,,,,,,,,,,
"O thou from whom all goodness flows","O thou from whom all goodness flows",o_thou_from_whom_all_goodness_flows,"The Brick Church Hymns, Designed for the Use of Social Prayer Meetings and Families, selected from the most approved authors",BCHD1823,24,,,,,8.6.8.6,,,,,,
"O Thou from whom all goodness flows","O Thou from whom all goodness flows",o_thou_from_whom_all_goodness_flows,"The Sacred Melodeon and The Juvenile Numeral Singer",SMTJ1852,d32,,,"Thomas Haweis",,,,,,,,
"O thou from whom all goodness flows","O thou from whom all goodness flows",o_thou_from_whom_all_goodness_flows,"Devotional Melodies: or, a collection of original and selected tunes and hymns, designed for congregational and social worship. (2nd ed.)",DM21859,33,,,,,,,,,English,,
"O thou from whom all goodness flows","O thou from whom all goodness flows",o_thou_from_whom_all_goodness_flows,"The Brethren Hymnal: A Collection of Psalms, Hymns and Spiritual Songs suited for Song Service in Christian Worship, for Church Service, Social Meetings and Sunday Schools",TBH1901,34,,,"Thomas Haweis","E. A. Brooks",,"LORD, REMEMBER ME",lord_remember_me_brooks,333556165316532,English,,
"O Thou from Whom all goodness flows","O Thou from Whom all goodness flows",o_thou_from_whom_all_goodness_flows,"Hymn Book of the United Evangelical Church",HBUE1897,41,,,"Rev. Thomas Haweis",,,,,,English,,
"O Thou from Whom all goodness flows","O Thou from Whom all goodness flows",o_thou_from_whom_all_goodness_flows,"Evangelical Hymnal",EH1897,41,,,"Rev. Thomas Haweis","William Tansur",,"ST. MARTIN'S",st_martins_tansur_11215,112151233454312,English,,
"O Thou from whom all goodness flows","O Thou from whom all goodness flows",o_thou_from_whom_all_goodness_flows,"Hymns and Carols for Church and Sunday-school",HCCS1879,47,,,"Thomas Haweis",,,,,,English,,
"O Thou from whom all goodness flows","O Thou from whom all goodness flows",o_thou_from_whom_all_goodness_flows,"Hymn Book for the Army and Navy",HBAN1863,d52,,,"Thomas Haweis",,,,,,English,,
"O Thou, from Whom all goodness flows","O Thou, from Whom all goodness flows",o_thou_from_whom_all_goodness_flows,"Hymns: the Yattendon Hymnal",Yatt,53,,,"Thos. Haweis, 1734-1820","H. E. W.",,"WINDSOR AND ETON",windsor_tye_daman,11232117354323354321,English,,"Windsor and Eton, 1591"
"O Thou, from whom all goodness flows","O Thou, from whom all goodness flows",o_thou_from_whom_all_goodness_flows,"Mawl a chân = praise and song : llyfr hymnau a thonau i Gymru ar Wasgar = hymnal for Welsh and English church worship / crynhoad pwyllgor Eglwys Gymraeg, Detroit, Michigan",MAC1952,56b,,,"T. H.","J. Ambrose Lloyd",,ABERGELE,abergele_lloyd,56711321171223,,,
"O Thou from whom all goodness flows","O Thou from whom all goodness flows",o_thou_from_whom_all_goodness_flows,"Church Hymnal",CH1886,58,,,,,,BURFORD,burford_purcell,1123454327123455,English,,"Old Melody"
"O Thou, from Whom all goodness flows","O Thou, from Whom all goodness flows",o_thou_from_whom_all_goodness_flows,"Old and New Welsh and English Hymns",ONWE1939,59b,,,"T. Haweis","Daniel Protheroe",,MILWAUKEE,milwaukee_protheroe,55321117655671432,English,,
"O thou, from whom all goodness flows","O thou, from whom all goodness flows",o_thou_from_whom_all_goodness_flows,"Evangelical Musick: or, The Sacred Minstrel and Sacred Harp United: consisting of a great variety of psalm and hymn tunes, set pieces, anthems, etc. (10th ed)",EMTS1839,60b,,,,,,,,,English,,
"O Thou from whom all goodness flows","O Thou from whom all goodness flows",o_thou_from_whom_all_goodness_flows,"Sabbath School Choir",SSC1857,d61,,,"Thomas Haweis",,,,,,,,
"O Thou from whom all goodness flows","O Thou from whom all goodness flows",o_thou_from_whom_all_goodness_flows,"The Army Hymn Book",AHB1863,d61,,,"Thomas Haweis",,,,,,,,
"O Thou from whom all goodness flows","O Thou from whom all goodness flows",o_thou_from_whom_all_goodness_flows,"Sunday School Hymns and Tunes",SSHT1877,d61,,,"Thomas Haweis",,,,,,,,
"O Thou, from whom all goodness flows","O Thou, from whom all goodness flows",o_thou_from_whom_all_goodness_flows,"Hymnal Companion to the Prayer Book: suited to the special seasons of the Christian year, and other occasions of public worship, as well as for use in the Sunday-school...With accompanying tunes",HCPB1886,62a,,,,,,,,,English,,
"O Thou, from whom all goodness flows","O Thou, from whom all goodness flows",o_thou_from_whom_all_goodness_flows,"Hymnal Companion to the Prayer Book: suited to the special seasons of the Christian year, and other occasions of public worship, as well as for use in the Sunday-school...With accompanying tunes",HCPB1886,62b,,,,,,,,,English,,