meter,displayTitle,firstLine,textAuthNumber,hymnalTitle,hymnalID,number,textTitle,refrainFirstLine,authors,composers,tuneTitle,tuneAuthNumber,incipit,languages,textSources,tuneSources
8.6.8.6,"Psalm 7","My trust is in my heav'nly Friend",my_trust_is_in_my_heavenly_friend,"Psalms and Hymns of Isaac Watts, The",PHW,Ps.14,"Psalm 7",,"Isaac Watts",,,,,English,,
8.6.8.6,"Psalm 131","Is there ambition in my heart?",is_there_ambition_in_my_heart,"Psalms and Hymns of Isaac Watts, The",PHW,Ps.300,"Psalm 131",,"Isaac Watts",,,,,English,,
8.6.8.6,"Psalm 139  Part 1","In all my vast concerns with thee",in_all_my_vast_concerns_with_thee,"Psalms and Hymns of Isaac Watts, The",PHW,Ps.317,"Psalm 139  Part 1",,"Isaac Watts",,,,,English,,
8.6.8.6,"Psalm 139  Part 2","When I with pleasing wonder stand",when_i_with_pleasing_wonder_stand,"Psalms and Hymns of Isaac Watts, The",PHW,Ps.318,"Psalm 139  Part 2",,"Isaac Watts",,,,,English,,
8.6.8.6,"Psalm 139  Part 3","Lord, when I count thy mercies o'er",lord_when_i_count_thy_mercies_oer,"Psalms and Hymns of Isaac Watts, The",PHW,Ps.319,"Psalm 139  Part 3",,"Isaac Watts",,,,,English,,
8.6.8.6,"In all my vast concerns with thee","In all my vast concerns with thee",in_all_my_vast_concerns_with_thee,"The Psalms and Hymns of Dr. Watts",PHDW1835,11,,,"Isaac Watts",,,,,English,,
8.6.8.6,"When I with pleasing wonder stand","When I with pleasing wonder stand",when_i_with_pleasing_wonder_stand,"The Psalms and Hymns of Dr. Watts",PHDW1835,57,,,"Isaac Watts",,,,,English,,
8.6.8.6,"Is there ambition in my heart?","Is there ambition in my heart?",is_there_ambition_in_my_heart,"The Psalms and Hymns of Dr. Watts",PHDW1835,297,,,"Isaac Watts",,,,,English,,
8.6.8.6,"Lord, when I count thy mercies o'er","Lord, when I count thy mercies o'er",lord_when_i_count_thy_mercies_oer,"The Psalms and Hymns of Dr. Watts",PHDW1835,580,,,"Isaac Watts",,,,,English,,
8.8.8.8,"Psalm 139  Part 1","Lord, thou hast searched and seen me through",lord_thou_hast_searched_and_seen_me_thro,"Psalms and Hymns of Isaac Watts, The",PHW,Ps.314,"Psalm 139  Part 1",,"Isaac Watts",,,,,English,,
8.8.8.8,"Psalm 139  Part 2","'Twas from thy hand, my God, I came",twas_from_thy_hand_my_god_i_came,"Psalms and Hymns of Isaac Watts, The",PHW,Ps.315,"Psalm 139  Part 2",,"Isaac Watts",,,,,English,,
8.8.8.8,"Psalm 139  Part 3","My God, what inward grief I feel",my_god_what_inward_grief_i_feel,"Psalms and Hymns of Isaac Watts, The",PHW,Ps.316,"Psalm 139  Part 3",,"Isaac Watts",,,,,English,,
8.8.8.8,"Lord! thou hast search'd and seen me thro'","Lord! thou hast search'd and seen me thro'",lord_thou_hast_searched_and_seen_me_thro,"The Psalms and Hymns of Dr. Watts",PHDW1835,10,,,"Isaac Watts",,,,,English,,
8.8.8.8,"'Twas from thy hand, my God, I came","'Twas from thy hand, my God, I came",twas_from_thy_hand_my_god_i_came,"The Psalms and Hymns of Dr. Watts",PHDW1835,56,,,"Isaac Watts",,,,,English,,
8.8.8.8,"Who shall the Lord's elect condemn?","Who shall the Lord's elect condemn?",who_shall_the_lords_elect_condemn,"The Psalms and Hymns of Dr. Watts",PHDW1835,289,,,"Isaac Watts",,,,,English,,
8.8.8.8,"My God, what inward grief I feel","My God, what inward grief I feel",my_god_what_inward_grief_i_feel,"The Psalms and Hymns of Dr. Watts",PHDW1835,336,,,"Isaac Watts",,,,,English,,
