displayTitle,firstLine,textAuthNumber,hymnalTitle,hymnalID,number,textTitle,refrainFirstLine,authors,composers,meter,tuneTitle,tuneAuthNumber,incipit,languages,textSources,tuneSources
"See Where the Great Incarnate God","See where the great incarnate God",see_where_the_great_incarnate_god,"The Cyber Hymnal",CYBER,5966,"See Where the Great Incarnate God",,"Isaac Watts",,8.6.8.6,HUNNYS,hunnys_13423,134232171433233,English,"<cite>Hymns and Spiritual Songs</cite>, 1707-9","<cite>Seven Sobs of a Sorrowful Soul</cite>, 1585"
"See where the great incarnate God","See where the great incarnate God",see_where_the_great_incarnate_god,"The Psalms of David: imitated in the language of the New Testament, and applied to the Christian state and worship (27th ed.)",PDIL1766,I.XLV,,,,,,,,,English,,
"See, where the great incarnate God","See, where the great incarnate God",see_where_the_great_incarnate_god,"The Psalms and Hymns of Dr. Watts",PHDW1835,680,,,"Isaac Watts; Isaac Watts",,8.6.8.6,,,,English,,
"See! where the great incarnate God","See! where the great incarnate God",see_where_the_great_incarnate_god,"Church Psalmody: a Collection of Psalms and Hymns adapted to public worship",CPCP1831,H624,,,,,,,,,English,,
"See where the great incarnate God","See where the great incarnate God",see_where_the_great_incarnate_god,"Hymns Selected from Dr. Watts, Dr. Doddridge and Various Other Writers",HSDW1803,d173,,,"Isaac Watts, 1674-1748",,,,,,English,,
"See where the great incarnate God","See where the great incarnate God",see_where_the_great_incarnate_god,"Hymns Selected",HS1808,d174,,,"Isaac Watts, 1674-1748",,,,,,English,,
"See where the great incarnate God","See where the great incarnate God",see_where_the_great_incarnate_god,"Union Hymns: adapted to Social Meetings and Family Worship Selected from Church Psalmody, with Additional Hymns",UHSM1834,d344,,,"Isaac Watts, 1674-1748",,,,,,,,
"See! where the great incarnate God","See! where the great incarnate God",see_where_the_great_incarnate_god,"Church Psalmody: a Collection of Psalms and Hymns Adapted to Public Worship",CPCP1843,624,,,,,,,,,English,,
"See! where the great incarnate God","See! where the great incarnate God",see_where_the_great_incarnate_god,"Manual of Christian Psalmody: a collection of psalms and hymns for public worship",MoCP1832,624,,,,,,,,,English,,
"See where the great incarnate God","See where the great incarnate God",see_where_the_great_incarnate_god,"The Psalms, Hymns and Spiritual Songs of the Rev. Isaac Watts, D. D.:  to which are added select hymns, from other authors; and directions for musical expression (New ed.)",PHS1834,A45,,,"Isaac Watts, 1674-1748",,,,,,,,
"See where the great incarnate God","See where the great incarnate God",see_where_the_great_incarnate_god,"The Discipline of the United Freewill Baptist Church: together with hymns and spiritual songs, for the use of its members",DUFB1819,76,,,,,,,,,,,
"See where the great incarnate God","See where the great incarnate God",see_where_the_great_incarnate_god,"The Psalms of David ... New ed.",PoDN1808,d188,,,"Isaac Watts, 1674-1748",,,,,,,,
"See where the great incarnate God","See where the great incarnate God",see_where_the_great_incarnate_god,"Christian's Duty, exhibited in a series of hymns: collected from various authors, designed for the worship of God, and for the edification of Christians, recommended to the serious..(4th ed. improved)",CDRS1825,255,,,"Isaac Watts, 1674-1748",,,,,,English,,
"See where the great incarnate God","See where the great incarnate God",see_where_the_great_incarnate_god,"The Columbian Repository: or, Sacred Harmony: selected from European and American authors with many new tunes not before published",CRSH1803,399,,,"Isaac Watts, 1674-1748",,,,,,,,
"See where the great incarnate God","See where the great incarnate God",see_where_the_great_incarnate_god,"Psalms and Hymns: adapted to social, private and public worship in the Cumberland Presbyterian Chruch",PHAS1859,684,,,"Isaac Watts, 1674-1748",,,,,,,,
"Hymn 45","See where the great incarnate God",see_where_the_great_incarnate_god,"Psalms and Hymns of Isaac Watts, The",PHW,I.45,"Hymn 45",,"Isaac Watts",,8.6.8.6,,,,English,,
"The Last Judgment","See where the great incarnate God",see_where_the_great_incarnate_god,"The Psalms, Hymns and Spiritual Songs of the Old and New Testament, faithully translated into English metre: being the New England Psalm Book (Rev. and Improved)",PHSS1758,XLVIII,"The Last Judgment",,,,,,,,English,,
"The last Judgment","See where the great incarnate God",see_where_the_great_incarnate_god,"Hymns and Spiritual Songs, in Three Books: I. collected from the scriptures, II. composed on divine subjects, III. prepared for the Lord's Supper",HSS31769,I.XLV,"The last Judgment",,,,8.6.8.6,,,,English,,
"The last Judgment","See where the great incarnate God",see_where_the_great_incarnate_god,"The Christians Duty, exhibited, in a series of Hymns: collected from various authors, designed for the worship of God, and for the edification of Christians (1st Ed.)",CD1791,CCLV,"The last Judgment",,,,,,,,English,,
"The Last Judgment","See where the great incarnate God",see_where_the_great_incarnate_god,"The Psalms Hymns and Spiritual Songs of the Old and New Testament, faithfully translated into English Metre: being the New-England Psalm-Book, revised and improved... (2nd ed.)",PH1773,XLVIII,"The Last Judgment",,,,,,,,English,,
"The last judgment","See where the great incarnate God",see_where_the_great_incarnate_god,"The Christian's Duty: exhibited in a series of hymns collected from various authors designed for the worship of God, and for the edification of Christians (2nd ed.)",CD21801,CCLV,"The last judgment",,,,,,,,English,,
