displayTitle,firstLine,textAuthNumber,hymnalTitle,hymnalID,number,textTitle,refrainFirstLine,authors,composers,meter,tuneTitle,tuneAuthNumber,incipit,languages,textSources,tuneSources
"The River of Thy Grace","The river of Thy grace is flowing free",the_river_of_thy_grace_is_flowing_free,"The Cyber Hymnal",CYBER,5826,"The River of Thy Grace","Earthly joys cannot compare with all the glory","Paul Rader","Arthur W. McKee",,"[The river of Thy grace is flowing free]",the_river_of_thy_grace_is_flowing_mckee,535456432333212,English,,
"To Eternity","The river of Thy grace is flowing free",the_river_of_thy_grace_is_flowing_free,"Tabernacle Hymns: Number Four: a choice collection of hymns and songs for every religious use",TH41952,119,"To Eternity","Earthly joys cannot compare with all the glory","Paul Rader","Arthur W. McKee",,"[The river of Thy grace is flowing free]",the_river_of_thy_grace_is_flowing_mckee,535456432333212,English,,
"To Eternity","The river of Thy grace is flowing free",the_river_of_thy_grace_is_flowing_free,"The Tabernacle Hymns",TH1918,60,"To Eternity","Earthly joys cannot compare with all the glory","Paul Rader","Arthur W. McKee",,"[The river of Thy grace is flowing free]",the_river_of_thy_grace_is_flowing_mckee,535456432333212,,,
"To Eternity","The river of Thy grace is flowing free",the_river_of_thy_grace_is_flowing_free,"Tabernacle Praises No. 1",TPN11920,60,"To Eternity","Earthly joys cannot compare","Paul Rader","Arthur W. McKee",,"[The river of Thy grace is flowing free]",the_river_of_thy_grace_is_flowing_mckee,535456432333212,,,
"To Eternity","The river of thy grace is flowing free",the_river_of_thy_grace_is_flowing_free,"Glad Tidings in Song",GTS1921,71,"To Eternity","Earthly joys cannot compare with all the glory","Paul Rader","Arthur W. McKee",,"[The river of thy grace is flowing free]",the_river_of_thy_grace_is_flowing_mckee,535456432333212,English,,
"To Eternity","The river of thy grace is flowing free",the_river_of_thy_grace_is_flowing_free,"Awakening Songs for the Church, Sunday School and Evangelistic Services",ASCS1917,83,"To Eternity","Earthly joys cannot compare","Paul Rader","Arthur W. McKee",,"[The river of thy grace is flowing free]",the_river_of_thy_grace_is_flowing_mckee,535456432333212,English,,
"To Eternity","The river of Thy grace is flowing free",the_river_of_thy_grace_is_flowing_free,"Old Fashioned Revival Hour Songs",OF1R1950,100,"To Eternity","Earthly joys cannot compare with all the glory","Paul Rader","Arthur W. McKee",,"[The river of Thy grace is flowing free]",the_river_of_thy_grace_is_flowing_mckee,535456432333212,English,,
"To Eternity","The river of Thy grace is flowing free",the_river_of_thy_grace_is_flowing_free,"Tabernacle Hymns: number three: for the church and Sunday school",TH31931,119,"To Eternity","Earthly joys cannot compare with all the glory","Paul Rader","Arthur W. McKee",,"[The river of Thy grace is flowing free]",the_river_of_thy_grace_is_flowing_mckee,535456432333212,English,,
"To Eternity","The river of Thy grace is flowing free",the_river_of_thy_grace_is_flowing_free,"Tabernacle Hymns: No. 2",TH21921,241,"To Eternity","Earthly joys cannot compare with all the glory","Paul Rader","Arthur W. McKee",,"[The river of Thy grace is flowing free]",the_river_of_thy_grace_is_flowing_mckee,535456432333212,,,
"To Eternity","The river of Thy grace is flowing free",the_river_of_thy_grace_is_flowing_free,"The Greatest Hymns",GH1924,425,"To Eternity","Earthly joys cannot compare with all the glory","Paul Rader","Arthur W. McKee",,"[The river of Thy grace is flowing free]",the_river_of_thy_grace_is_flowing_mckee,535456432333212,English,,
"To Eternity","The river of Thy grace is flowing free",the_river_of_thy_grace_is_flowing_free,"Inspiring Hymns",IH1951,509,"To Eternity","Earthly joys cannot compare with all the glory","Paul Rader","Arthur W. McKee",,"[The river of Thy grace is flowing free]",the_river_of_thy_grace_is_flowing_mckee,535456432333212,English,,
"To eternity","The river of thy grace is flowing free",the_river_of_thy_grace_is_flowing_free,"Rader Campaign Carols",RCC1924,d49,"To eternity","Earthly joys cannot compare with all the glory","Paul Rader",,,,,,English,,
"To eternity","The river of thy grace is flowing free",the_river_of_thy_grace_is_flowing_free,"Glad Tidings in Song",GTS1920,d77,"To eternity","Earthly joys cannot compare with all the glory","Paul Rader",,,,,,English,,
"To eternity","The river of thy grace is flowing free",the_river_of_thy_grace_is_flowing_free,"Songs of Praises, a General Purpose Evangelistic Song Book",SPGP1929,d164,"To eternity","Earthly joys cannot compare with all the glory","Paul Rader",,,,,,,,
