displayTitle,firstLine,textAuthNumber,hymnalTitle,hymnalID,number,textTitle,refrainFirstLine,authors,composers,meter,tuneTitle,tuneAuthNumber,incipit,languages,textSources,tuneSources
"The heaven of heavens cannot contain","The heaven of heavens cannot contain",the_heaven_of_heavens_cannot_contain,"Baptist Chorals: a tune and hymn book designed to promote general congregational singing; containing one hundred and sixty four tunes adapted to about four hundred choice hymns ",BCTH1860,206,,,,,,,,,English,,
"The heaven of heavens cannot contain","The heaven of heavens cannot contain",the_heaven_of_heavens_cannot_contain,"A Collection of Psalms and Hymns for Social and Private Worship",CPHS1823,XXXIII,,,,,,,,,English,,
"The heaven of heavens cannot contain","The heaven of heavens cannot contain",the_heaven_of_heavens_cannot_contain,"Hymn Book for Christian Worship. 8th ed.",HBCW1864,a59,,,Drennan,,,,,,English,,
"The heaven of heavens cannot contain","The heaven of heavens cannot contain",the_heaven_of_heavens_cannot_contain,"The School Hymn-Book: for normal, high, and grammar schools",SHBN1850,4,,,Drennan,,,,,,,,
"The heaven of heavens cannot contain","The heaven of heavens cannot contain",the_heaven_of_heavens_cannot_contain,"Hymns for Public Worship",HPW1845,10,,,Drennan,,,,,,English,,
"The heaven of heavens cannot contain","The heaven of heavens cannot contain",the_heaven_of_heavens_cannot_contain,"The Baptist Psalmody: a selection of hymns for the worship of God",BP1850,11,,,"W. Drennan",,,,,,,,
"The heaven of heavens cannot contain","The heaven of heavens cannot contain",the_heaven_of_heavens_cannot_contain,"A Collection of Psalms and Hymns for Christian Worship",CPHC1830,15,,,Drennan,,,,,,English,,
"The heaven of heavens cannot contain","The heaven of heavens cannot contain",the_heaven_of_heavens_cannot_contain,"A Collection of Psalms and Hymns for Christian Worship. (45th ed.)",CPHC1846,15,,,"W. Drennan",,,,,,English,,
"The heaven of heavens cannot contain","The heaven of heavens cannot contain",the_heaven_of_heavens_cannot_contain,"A Collection of Psalms and Hymns for Christian Worship. (3rd ed.)",CPHC1831,15,,,Drennan,,,,,,English,,
"The heaven of heavens cannot contain","The heaven of heavens cannot contain",the_heaven_of_heavens_cannot_contain,"A Collection of Psalms and Hymns for Christian Worship (6th ed.)",CPHC1832,15,,,Drennan,,8.6.8.6,,,,English,,
"The heaven of heavens cannot contain","The heaven of heavens cannot contain",the_heaven_of_heavens_cannot_contain,"A Collection of Psalms and Hymns for Christian Worship (10th ed.)",CPHC1833,15,,,Drennan,,8.6.8.6,,,,English,,
"The heaven of heavens cannot contain","The heaven of heavens cannot contain",the_heaven_of_heavens_cannot_contain,"A Collection of Psalms and Hymns for Christian Worship. 16th ed.",CPHC1835,15,,,Drennan,,8.6.8.6,,,,English,,
"The heaven of heavens cannot contain","The heaven of heavens cannot contain",the_heaven_of_heavens_cannot_contain,"A Collection of Hymns, for the Christian Church and Home",CHCC1843,27,,,Drennan,,,,,,English,,
"The heaven of heavens cannot contain","The heaven of heavens cannot contain",the_heaven_of_heavens_cannot_contain,"Hymn and Tune Book, for the Church and the Home",HTBC1871,29,,,Drennan,,,,,,English,,
"The heaven of heavens cannot contain","The heaven of heavens cannot contain",the_heaven_of_heavens_cannot_contain,"Hymn Book of the Methodist Protestant Church",HBMP1859,31,,,Drennan,,,,,,English,,
"The heaven of heavens cannot contain","The heaven of heavens cannot contain",the_heaven_of_heavens_cannot_contain,"Hymn Book of the Methodist Protestant Church. (11th ed.)",HBMP1854,31,,,Drennan,,,,,,English,,
"The heaven of heavens cannot contain","The heaven of heavens cannot contain",the_heaven_of_heavens_cannot_contain,"Hymns for the Sanctuary",H4S1849,39,,,Drennan,,,,,,English,,
"The heaven of heavens cannot contain","The heaven of heavens cannot contain",the_heaven_of_heavens_cannot_contain,"Melodies and Hymns for Divine Service in Appleton Chapel",MHDS1870,d54,,,"W. Drennan",,,,,,English,,
"The heaven of heavens cannot contain","The heaven of heavens cannot contain",the_heaven_of_heavens_cannot_contain,"Hymn Book for Christian Worship",HBCW1854,59,,,Drennan,,,,,,English,,
"The heaven of heavens cannot contain","The heaven of heavens cannot contain",the_heaven_of_heavens_cannot_contain,"Hymns for the Church of Christ (3rd thousand)",H4Co1853,70,,,,,,,,,English,,
"The heaven of heavens cannot contain","The heaven of heavens cannot contain",the_heaven_of_heavens_cannot_contain,"Hymns for the Church of Christ. (6th thousand)",HCC61857,70,,,,,,,,,English,,
"The heaven of heavens cannot contain","The heaven of heavens cannot contain",the_heaven_of_heavens_cannot_contain,"The Disciples' Hymn Book: a collection of hymns and chants for public and private devotion",DHBC1844,76,,,Drennan,,,,,,,,
"The heaven of heavens cannot contain","The heaven of heavens cannot contain",the_heaven_of_heavens_cannot_contain,"Hymn and Tune Book for the Church and the Home. (Rev. ed.)",HTBC1883,89,,,"William Drennan",,,,,,English,,
"The heaven of heavens cannot contain","The heaven of heavens cannot contain",the_heaven_of_heavens_cannot_contain,"A Collection of Psalms and Hymns, for Social and Private Worship",CPHS1820,95,,,Drennan,,,,,,English,,
"The heaven of heavens cannot contain","The heaven of heavens cannot contain",the_heaven_of_heavens_cannot_contain,"A Collection of Psalms and Hymns, for Social and Private Worship (Rev. ed.  with supplement)",CPHS1845,95,,,Drennan,,,,,,English,,
"The heaven of heavens cannot contain","The heaven of heavens cannot contain",the_heaven_of_heavens_cannot_contain,"Sacred Poetry and Music Reconciled; or a Collection of Hymns, Original and Compiled",SPMR1830,103,,,,,,,,,,,
"The heaven of heavens cannot contain","The heaven of heavens cannot contain",the_heaven_of_heavens_cannot_contain,"Hymns for Christian Devotion: especially adapted to the Universalist denomination",HCDA1846,118,,,"W. Drennan",,,,,,English,,
"The heaven of heavens cannot contain","The heaven of heavens cannot contain",the_heaven_of_heavens_cannot_contain,"Hymns for Christian Devotion: especially adapted to the Universalist denomination. (New ed.)",HFCD1871,118,,,Drennan,,8.6.8.6,,,,English,,
"The heaven of heavens cannot contain","The heaven of heavens cannot contain",the_heaven_of_heavens_cannot_contain,"A Collection of Psalms and Hymns for the Sanctuary",CPH1845,133,,,Drennan,,,,,,English,,
"The heaven of heavens cannot contain","The heaven of heavens cannot contain",the_heaven_of_heavens_cannot_contain,"Hymns, Selected from Various Authors, for the Use of the Unitarian Church in Washington",HSVA1821,d134,,,"W. Drennan",,,,,,English,,
"The heaven of heavens cannot contain","The heaven of heavens cannot contain",the_heaven_of_heavens_cannot_contain,"The Sabbath School Hymnal",SSH1904,d134,,,"W. Drennan",,,,,,,,
"The heaven of heavens cannot contain","The heaven of heavens cannot contain",the_heaven_of_heavens_cannot_contain,"Hymns and Anthems adapted for Jewish Worship",HAJW1887,164,,,,,,,,,English,,
"The heaven of heavens cannot contain","The heaven of heavens cannot contain",the_heaven_of_heavens_cannot_contain,"The Psalmist: a New Collection of Hymns for the Use of the Baptist Churches",PNCH1843,167,,,Drennan,,,,,,,,
"The heaven of heavens cannot contain","The heaven of heavens cannot contain",the_heaven_of_heavens_cannot_contain,"The Psalmist: a new collection of hymns for the use of Baptist churches; with a supplement",PSRF1847,167,,,Drennan,,,,,,,,
"The heaven of heavens cannot contain","The heaven of heavens cannot contain",the_heaven_of_heavens_cannot_contain,"Church Harmonies: a collection of hymns and tunes for the use of Congregations",CHCH1876,181,,,Drennan,,,,,,English,,
"The Heaven of Heavens cannot contain","The Heaven of Heavens cannot contain",the_heaven_of_heavens_cannot_contain,"Christian Chorals: for the Chapel and Fireside",CCCF1885,229,,,"William Drennan","Ludwig van Beethoven",,ANASTASIA,consolation_beethoven,51111321522432533334,English,,
"The heaven of heavens cannot contain","The heaven of heavens cannot contain",the_heaven_of_heavens_cannot_contain,"Grammar School Hymn Book",GSHB1871,d243,,,"W. Drennan",,,,,,English,,
"The heaven of heavens cannot contain","The heaven of heavens cannot contain",the_heaven_of_heavens_cannot_contain,"The Modern Harp: or, Boston Sacred Melodist.",MHBS1846,d247,,,"W. Drennan",,,,,,,,
"The heaven of heavens cannot contain","The heaven of heavens cannot contain",the_heaven_of_heavens_cannot_contain,"Sacred Songs for Family and Social Worship: comprising the most approved spiritual hymns with chaste and popular tunes ( New ed. rev. and enl.)",SSFS1855,258,,," Drennan",,,,,,,,
"The heaven of heavens cannot contain","The heaven of heavens cannot contain",the_heaven_of_heavens_cannot_contain,"The Old Baptist Hymn Book",OBHB1842,d268,,,"W. Drennan",,,,,,,,
"The heaven of heavens cannot contain","The heaven of heavens cannot contain",the_heaven_of_heavens_cannot_contain,"Hymns of the Spirit",HoS1864,286,,,,,,,,,English,,
"The heaven of heavens cannot contain","The heaven of heavens cannot contain",the_heaven_of_heavens_cannot_contain,"The Oxford Hymn Book",OxHB,296,,,,,8.6.8.6,,,,English,,
"The heaven of heavens cannot contain","The heaven of heavens cannot contain",the_heaven_of_heavens_cannot_contain,"The Oxford Hymn Book",OxHB1920,296,,,"William Drennan (1754-1820)","Frederick William Herschel (1738-1822); Alfred Pettet (c. 1785-c. 1845)",,HERSCHEL,herschel_herschel,5436543321341765,English,,
"The heaven of heavens cannot contain","The heaven of heavens cannot contain",the_heaven_of_heavens_cannot_contain,"The Golden Hymn Book",GHBC1903,312,,,"W. Drennan",,,,,,English,,
"The heaven of heavens cannot contain","The heaven of heavens cannot contain",the_heaven_of_heavens_cannot_contain,"The Book of Praise",BoP1865,d334,,,"W. Drennan",,,,,,,,
"The heaven of heavens cannot contain","The heaven of heavens cannot contain",the_heaven_of_heavens_cannot_contain,"Hymns for the Christian Church, for the Use of the First Church of Christ in Boston",HCCU1869,364,,,Drennan,,,,,,English,,
"The heaven of heavens cannot contain","The heaven of heavens cannot contain",the_heaven_of_heavens_cannot_contain,"Psalms and Hymns, for Social and Private Worship",PHSP1822,d391,,,"W. Drennan",,,,,,,,
"The heaven of heavens cannot contain","The heaven of heavens cannot contain",the_heaven_of_heavens_cannot_contain,"Hymns for Children and Young Persons",HCYP1854,d392,,,"W. Drennan",,,,,,English,,
"The heaven of heavens cannot contain","The heaven of heavens cannot contain",the_heaven_of_heavens_cannot_contain,"Supplement to Watts:  a Selection of More than Five Hundred Hymns, from the Most Approved Authors on a Great Variety of Subjects ...",SWSM1832,d395,,,"W. Drennan",,,,,,,,
"The heaven of heavens cannot contain","The heaven of heavens cannot contain",the_heaven_of_heavens_cannot_contain,"A Church of England Hymn Book: adapted to the daily services of the Church throughout the year",CEHB1880,420,,,,,8.6.8.6,,,,English,,
