displayTitle,firstLine,textAuthNumber,hymnalTitle,hymnalID,number,textTitle,refrainFirstLine,authors,composers,meter,tuneTitle,tuneAuthNumber,incipit,languages,textSources,tuneSources
"All Praise to Thee, O Lord","All praise to Thee, O Lord",all_praise_to_thee_o_lord_who_by,"The Hymnal and Order of Service",HOoS1937,74,"All Praise to Thee, O Lord",,"Hyde W. Beadon",,,,,,,,
"All Praise to Thee, O Lord","All praise to Thee, O Lord",all_praise_to_thee_o_lord_who_by,"The Hymnal and Order of Service",HOoS1926,74,"All Praise to Thee, O Lord",,"Hyde Wyndham Beadon","Robert Schumann, (1810-1856)",6.6.8.6,SCHUMANN,schumann_masonwebb,51567114321177156712,English,,
"All praise to Thee, O Lord","All praise to Thee, O Lord",all_praise_to_thee_o_lord_who_by,"The Lutheran Hymnary",LHPN1913,232,,,"H. W. Beadon","J. Stephenson",6.6.8.6,"[All praise to Thee]",sandford,511321543622312,,,
"All Praise to You, O Lord","All praise to you, O Lord",all_praise_to_thee_o_lord_who_by,"Lutheran Book of Worship",LBoW1978,78,"All Praise to You, O Lord",,"Hyde W. Beadon, 1812-1891","Kenneth G. Finlay, 1882-1974",6.6.8.6,GARELOCHSIDE,garelochside_finlay,53212312351716,English,,
"All praise to you, O Lord","All praise to you, O Lord",all_praise_to_thee_o_lord_who_by,"The Book of Praise",TBP1997,181,"All praise to you, O Lord",,"Hyde W. Beadon, 1812-1891","William Henry Monk, 1823-1889",,"ST. ETHELWALD",st_ethelwald_monk,54323433256655671322,English,,
"All Praise to You, O Lord","All praise to you, O Lord",all_praise_to_thee_o_lord_who_by,"Moravian Book of Worship",Mor1995,312,"All Praise to You, O Lord",,"Hyde W. Beadon, 1812-1891","Charles Lockhart, 1745-1815",6.6.8.6,CARLISLE,carlisle_lockhart,151321711456514,English,,
"All praise to you, O Lord","All praise to you, O Lord",all_praise_to_thee_o_lord_who_by,"CPWI Hymnal",CPWI2010,106,,,"Hyde Wyndham Beadon, 1812-1891","Charles Lockhart, 1745-1815",6.6.8.6,CARLISLE,carlisle_lockhart,151321711456514,English,,
"All praise to you, O Lord","All praise to you, O Lord",all_praise_to_thee_o_lord_who_by,"The Hymnal 1982: according to the use of the Episcopal Church",EH1982,138,,,"Hyde W. Beadon, 1812-1891","Charles Lockhart, 1745-1815",6.6.8.6,CARLISLE,carlisle_lockhart,151321711456514,English,,
"All praise to thee, O Lord","All praise to thee, O Lord",all_praise_to_thee_o_lord_who_by,"The Hymnal of the Reformed Church in the United States",HRCU1890,d20,,,"Hyde W. Beadon",,,,,,,,
"All praise to thee, O Lord","All praise to thee, O Lord",all_praise_to_thee_o_lord_who_by,"The Hymnal of the Evangelical Lutheran Augustana Synod. Text ed.",HELA1923,d21,,,"Hyde W. Beadon",,,,,,English,,
"All praise to thee, O Lord","All praise to thee, O Lord",all_praise_to_thee_o_lord_who_by,"The Sarum Hymnal",SarumH,72,,,,,6.6.8.6,,,,,,
"All praise to Thee, O Lord","All praise to Thee, O Lord",all_praise_to_thee_o_lord_who_by,"Hymns for the Reformed Church in the United States",HRCU1874,73,,,"Hyde W. Beadon",,,,,,English,,
"All praise to Thee, O Lord","All praise to Thee, O Lord",all_praise_to_thee_o_lord_who_by,"The Westminster Abbey Hymn-Book: compiled under the authority of the dean of Westminster",WAHB1897,85,,,"H. W. Beadon","John E. West",,"LAUS DEO",laus_deo_west,5622344325435576543,English,,
"All praise to thee, O Lord","All praise to thee, O Lord",all_praise_to_thee_o_lord_who_by,"The Presbyterian Hymnal",PH1878,120,,,,,,,,,English,,
"All praise to thee, O Lord","All praise to thee, O Lord",all_praise_to_thee_o_lord_who_by,"The Presbyterian Hymnal",PRH1878,120,,,,,,,,,,,
"All Praise to You, O Lord","[All Praise to You, O Lord]",all_praise_to_thee_o_lord_who_by,"Scripture Song Database",NTSONG,207,"All Praise to You, O Lord",,"Hyde W. Beadon",,,,,,English,"<i>Book of Praise</i>",
