displayTitle,firstLine,textAuthNumber,hymnalTitle,hymnalID,number,textTitle,refrainFirstLine,authors,composers,meter,tuneTitle,tuneAuthNumber,incipit,languages,textSources,tuneSources
"Not to the terrors of the Lord","Not to the terrors of the Lord",not_to_the_terrors_of_the_lord,"The Hymnal, Revised and Enlarged, as adopted by the General Convention of the Protestant Episcopal Church in the United States of America in the year of our Lord 1892",HRGC1892,392,"Not to the terrors of the Lord",,"Isaac Watts","W. Tansur",8.6.8.6,"[Not to the terrors of the Lord]",st_martins_tansur_11215,11215123,English,,
"Not to the Terrors of the Lord","Not to the terrors of the Lord",not_to_the_terrors_of_the_lord,"The Cyber Hymnal",CYBER,4662,"Not to the Terrors of the Lord",,"Isaac Watts","Israel Holdroyd",8.6.8.6,"ROCHESTER (Holdroyd)",rochester_holdroyd,11231271,English,"<cite>Hymns and Spiritual Songs, Book II</cite>, 1709, number 156",
"Not to the terrors of the Lord","Not to the terrors of the Lord",not_to_the_terrors_of_the_lord,"The Hymnary for use in Baptist churches",H4B1936,222,"Not to the terrors of the Lord",,"Isaac Watts, 1674-1748","Thomas Hastings, 1784-1872","8.6.8.6 with repeat",ORTONVILLE,ortonville_hastings,51122321566165511223,English,,
"Not to the terrors of the Lord","Not to the terrors of the Lord",not_to_the_terrors_of_the_lord,"The Church Hymnal: revised and enlarged in accordance with the action of the General Convention of the Protestant Episcopal Church in the United States of America in the year of our Lord 1892. (Ed. B)",HPEC1917,392,,,"I. Watts","W. Croft",8.6.8.6,"ST. ANNE",st_anne_croft,53651171515645,English,,
"Not to the Terrors of the Lord","Not to the terrors of the Lord",not_to_the_terrors_of_the_lord,"The Christian Hymnary. Bks. 1-4",CHB41972,401,"Not to the Terrors of the Lord",,"Isaac Watts, 1674-1748",Kirby,,COLESHILL,coleshill_barton,11D7U3D7U11D5U3543D7,English,,
"Not to the Terrors of the Lord","Not to the Terrors of the Lord",not_to_the_terrors_of_the_lord,"A New Version of the Psalms of David: fitted to the Tunes used in Churches",NVPD1760,HLXIX,,,,,,,,,English,,
"Not to the Terrors of the Lord ","Not to the Terrors of the Lord ",not_to_the_terrors_of_the_lord,"Appendix, Containing a Number of Hymns Taken Chiefly from Dr. Watts's Scriptural Collection",ACNH1765,LXIX,,,,,,,,,English,,
"Not to the Terrors of the Lord","Not to the Terrors of the Lord",not_to_the_terrors_of_the_lord,"Appendix, Containing a Number of Hymns, Taken Chiefly from Dr. Watts's Scripture Collection",ACNH1754,LXIX,,,,,,,,,English,,
"Not to the Terrors of the Lord ","Not to the Terrors of the Lord ",not_to_the_terrors_of_the_lord,"The Psalms of David: imitated in the language of the New Testament, and applied to the Christian state and worship (27th ed.)",PDIL1766,II.CLII,,,,,,,,,English,,
"Not to the terrors of the Lord","Not to the terrors of the Lord",not_to_the_terrors_of_the_lord,"The Book of Worship",BW1867,125,,,,,8.6.8.6,,,,English,,
"Not to the terrors of the Lord","Not to the terrors of the Lord",not_to_the_terrors_of_the_lord,"Hymnal: according to the use of the Protestant Episcopal Church in the United States of America",HPEC1871,184,,,,,8.6.8.6,,,,English,,
"Not to the terrors of the Lord","Not to the terrors of the Lord",not_to_the_terrors_of_the_lord,"A Collection of Hymns and Prayers, for Public and Private Worship",CHAP1845,398,,,,,8.6.8.6,,,,English,,
"Not to the terrors of the Lord","Not to the terrors of the Lord",not_to_the_terrors_of_the_lord,"The Psalms and Hymns of Dr. Watts",PHDW1835,486,,,"Isaac Watts",,8.6.8.6,,,,English,,
"Not to the terrors of the Lord","Not to the terrors of the Lord",not_to_the_terrors_of_the_lord,"A Collection of Hymns and A Liturgy: for the use of Evangelical Lutheran Churches; to which are added prayers for families and individuals",CHAL1814,515,,,,,8.6.8.6,,,,English,,
"Not to the terrors of the Lord","Not to the terrors of the Lord",not_to_the_terrors_of_the_lord,"Book of Worship (Rev. ed.)",BW1870,577,,,,,8.6.8.6,,,,English,,
"Not to the terrors of the Lord","Not to the terrors of the Lord",not_to_the_terrors_of_the_lord,"Hymns, Selected and Original: for public and private worship (1st ed.)",HSAO1828,744,,,,,8.6.8.6,,,,,,
"Not to the terrors of the Lord  the tempest fire and smoke","Not to the terrors of the Lord  the tempest fire and smoke",not_to_the_terrors_of_the_lord,"Sacred Poetry: consisting of psalms and hymns, adapted to Christian devotion, in public and private, selected from the best authors, with variations and additions",SPCP1795,H.CLXXXIII,,,"Isaac Watts, 1674-1748",,,,,,,,
"Not to the terrors of the Lord  the tempest fire and smoke","Not to the terrors of the Lord  the tempest fire and smoke",not_to_the_terrors_of_the_lord,"Psalms and Hymns Adapted to Public Worship, and Approved by the General Assembly of the Presbyterian Church in the United States of America",PHAP1830,H182,,,"Isaac Watts, 1674-1748",,,,,,,,
"Not to the terrors of the Lord","Not to the terrors of the Lord",not_to_the_terrors_of_the_lord,"Psalms and Hymns, for Christian Use and Worship",PHCU1845,H429,,,,,,,,,,,
"Not to the terrors of the Lord","Not to the terrors of the Lord",not_to_the_terrors_of_the_lord,"The Lecture-Room Hymn-Book: containing the psalms and hymns of the book of common prayer, together with a choice selection of additional hymns, and an appendix of chants and tunes...",LRHB1855,H26,,,,,,,,,,,
"Not to the terrors of the Lord  the tempest fire and smoke","Not to the terrors of the Lord  the tempest fire and smoke",not_to_the_terrors_of_the_lord,"Psalms, Hymns and Spiritual Songs, Original and Selected. (7th ed.)",PHSS1857,S83,,,"Isaac Watts, 1674-1748",,,,,,,,
"Not to the terrors of the Lord  the tempest fire and smoke","Not to the terrors of the Lord  the tempest fire and smoke",not_to_the_terrors_of_the_lord,"The Psalms, Hymns and Spiritual Songs of the Rev. Isaac Watts, D. D.:  to which are added select hymns, from other authors; and directions for musical expression (New ed.)",PHS1834,B152,,,"Isaac Watts, 1674-1748",,,,,,,,
"Not to the terrors of the Lord  the tempest fire and smoke","Not to the terrors of the Lord  the tempest fire and smoke",not_to_the_terrors_of_the_lord,"Psalms, Hymns and Spiritual Songs, Original and Selected. (14th stereotype ed.)",PHSS1850,S116,,,"Isaac Watts, 1674-1748",,,,,,,,
"Not to the terrors of the Lord","Not to the terrors of the Lord",not_to_the_terrors_of_the_lord,"Psalms, Hymns, and Spiritual Songs: original and selected (5th ed.)",PHSS1847,S116,,,,,,,,,,,
"Not to the terrors of the Lord","Not to the terrors of the Lord",not_to_the_terrors_of_the_lord,"Selections from the Psalms of David in Metre: with hymns suited to the feasts and fasts of the church, and other occasions of public worship",SPDM1832,H26,,,,,,,,,,,
"Not to the terrors of the Lord  the tempest fire and smoke","Not to the terrors of the Lord  the tempest fire and smoke",not_to_the_terrors_of_the_lord,"Sacred Poetry: Consisting of Psalms and Hymns, Adapted to Christian        Devotion, in Public and Private. 2nd ed.",SPCP1797,aH.CLXXXIII,,,"Isaac Watts, 1674-1748",,,,,,,,
"Not to the terrors of the Lord","Not to the terrors of the Lord",not_to_the_terrors_of_the_lord,"Plymouth Collection",PC1863,a705,,,Watts,,,,,,,,
"Not to the terrors of the Lord","Not to the terrors of the Lord",not_to_the_terrors_of_the_lord,"Hymn Book for Christian Worship. 8th ed.",HBCW1864,a298,,,Watts,,,,,,English,,
"Not to the terrors of the Lord","Not to the terrors of the Lord",not_to_the_terrors_of_the_lord,"A Collection of Sacred Song: being an eclectic compilation for the use of churches, families and schools... (2nd ed.)",CSS21861,9(H26),,,,,,,,,English,,
"Not to the terrors of the Lord","Not to the terrors of the Lord",not_to_the_terrors_of_the_lord,"A Collection of Sacred Song: being an eclectic compilation for the use of churches, families, and boarding-schools...",CoSS1859,9(H26),,,,,,,,,English,,
"Not to the terrors of the Lord","Not to the terrors of the Lord",not_to_the_terrors_of_the_lord,"Hymns of the Protestant Episcopal Church of the United States, as authorized by the General Convention: with an additional selection",HPEC1845,26,,,,,,,,,English,,
"Not to the terrors of the Lord  the tempest fire and smoke","Not to the terrors of the Lord  the tempest fire and smoke",not_to_the_terrors_of_the_lord,"Hymns and Spiritual Songs, Original and Selected, for the Use of Christians. (8th ed.)",HSSO1840,83,,,"Isaac Watts, 1674-1748",,,,,,English,,
"Not to the terrors of the Lord","Not to the terrors of the Lord",not_to_the_terrors_of_the_lord,"Hymns and Spiritual Songs, Original and Selected, for the Use of Christians. (5th ed.)",HASS1838,83,,,"Dr. Watts",,8.6.8.6,,,,English,,
"Not to the terrors of the Lord","Not to the terrors of the Lord",not_to_the_terrors_of_the_lord,"Christian Melodies: a selection of hymns and tunes designed for social and private worship in the lecture-room and the family",CM1851,96,,,Watts,,,,,,English,,
"Not to the terrors of the Lord","Not to the terrors of the Lord",not_to_the_terrors_of_the_lord,"Christian Melodies: a selection of hymns and tunes designed for social and private worship in the lecture-room and the family (2nd ed.)",CM1854,96,,,Watts,,,,,,English,,
"Not to the terrors of the Lord","Not to the terrors of the Lord",not_to_the_terrors_of_the_lord,"Carmina Sacra: or, Boston Collection of Church Music: comprising the most popular psalm and hymn tunes in eternal use together with a great variety of new tunes, chants, sentences, motetts...",CSBC1841,99b,,,,,,SINAI,sinai_11324,,English,,
"Not to the terrors of the Lord ","Not to the terrors of the Lord ",not_to_the_terrors_of_the_lord,"Hymns Recommended for use in the Reformed Episcopal Church",HRRE1874,106,,,,,,,,,English,,
"Not to the terrors of the Lord  the tempest fire and smoke","Not to the terrors of the Lord  the tempest fire and smoke",not_to_the_terrors_of_the_lord,"Hymns suited to the Feasts and Fasts of the Church and Other Occasions of  Public Worship ... approved by the Convention of 1826",HFFC1826,d111,,,"Isaac Watts, 1674-1748",,,,,,English,,
"Not to the terrors of the Lord","Not to the terrors of the Lord",not_to_the_terrors_of_the_lord,"Hymns for the Christian Church, for the Use of the First Church of Christ in Boston",HCCU1869,118,,,Watts,,,,,,English,,
"Not to the terrors of the Lord  the tempest fire and smoke","Not to the terrors of the Lord  the tempest fire and smoke",not_to_the_terrors_of_the_lord,"Psalms, Hymns and Spiritual Songs, 4th ed.",PHSS1834,d129,,,"Isaac Watts, 1674-1748",,,,,,,,
"Not to the terrors of the Lord  the tempest fire and smoke","Not to the terrors of the Lord  the tempest fire and smoke",not_to_the_terrors_of_the_lord,"A Choice Selection of Psalms, Hymns and Spiritual Songs for the use of  Christians",CSPH1819,142,,,"Isaac Watts, 1674-1748",,,,,,English,,
"Not to the terrors of the Lord  the tempest fire and smoke","Not to the terrors of the Lord  the tempest fire and smoke",not_to_the_terrors_of_the_lord,"The Christian Psalmist; or, Watts' Psalms and Hymns: with copious selections from other sources; the whole carefully revised and arranged, with directions for musical expression",CPWP1836,144,,,"Isaac Watts, 1674-1748",,,,,,,,
"Not to the terrors of the Lord  the tempest fire and smoke","Not to the terrors of the Lord  the tempest fire and smoke",not_to_the_terrors_of_the_lord,"Hymns Selected from Dr. Watts, Dr. Doddridge and Various Other Writers",HSDW1803,d148,,,"Isaac Watts, 1674-1748",,,,,,English,,
"Not to the terrors of the Lord  the tempest fire and smoke","Not to the terrors of the Lord  the tempest fire and smoke",not_to_the_terrors_of_the_lord,"Hymns Selected",HS1808,d148,,,"Isaac Watts, 1674-1748",,,,,,English,,
"Not to the terrors of the Lord  the tempest fire and smoke","Not to the terrors of the Lord  the tempest fire and smoke",not_to_the_terrors_of_the_lord,"The Psalms of David ... New ed.",PoDN1808,d155,,,"Isaac Watts, 1674-1748",,,,,,,,
"Not to the terrors of the Lord  the tempest fire and smoke","Not to the terrors of the Lord  the tempest fire and smoke",not_to_the_terrors_of_the_lord,"Hymns for the Hospital Chapel, Worcester",HHCW1850,d158,,,"Isaac Watts, 1674-1748",,,,,,English,,
"Not to the terrors of the Lord  the tempest fire and smoke","Not to the terrors of the Lord  the tempest fire and smoke",not_to_the_terrors_of_the_lord,"Hymns for the Use of the New Jerusalem Church",HUNJ1833,d164,,,"Isaac Watts, 1674-1748",,,,,,English,,
"Not to the terrors of the Lord","Not to the terrors of the Lord",not_to_the_terrors_of_the_lord,"Hymnal Companion to the Prayer Book: suited to the special seasons of the Christian year, and other occasions of public worship, as well as for use in the Sunday-school...With accompanying tunes",HCPB1886,164,,,,,,,,,English,,
"Not to the terrors of the Lord","Not to the terrors of the Lord",not_to_the_terrors_of_the_lord,"The Disciples' Hymn Book: a collection of hymns and chants for public and private devotion",DHBC1844,164,,,Watts,,,,,,,,
"Not to the terrors of the Lord","Not to the terrors of the Lord",not_to_the_terrors_of_the_lord,"Hymns and Chants: with offices of devotion. For use in Sunday-schools, parochial and week day schools, seminaries and colleges. Arranged according to the Church year",HCOD1861,166,,,,,,,,,English,,
