displayTitle,firstLine,textAuthNumber,hymnalTitle,hymnalID,number,textTitle,refrainFirstLine,authors,composers,meter,tuneTitle,tuneAuthNumber,incipit,languages,textSources,tuneSources
"He's So Freely Passing Out Blessings","He's so freely passing out blessings each day",hes_so_freely_passing_out_blessings_each,"Total Praise: songs and other worship resources for every generation",ToPr2011,372,"He's So Freely Passing Out Blessings","Ev'ry day He's blessing me","Damian D. Price","Damian D. Price",,"[He's so freely passing out blessings each day]",hes_so_freely_passing_out_blessing_price,53765365323537653653,English,,
"Count Your Blessings","When upon life's billows you are tempest-tossed",when_upon_lifes_billows_you_are_tempest,"Total Praise: songs and other worship resources for every generation",ToPr2011,525,"Count Your Blessings","Count your blessings","Johnson Oatman, Jr., 1856-1922","Edwin O. Excell, 1851-1921; Evelyn Simpson-Curenton, b. 1953","11.11.11.11 with refrain",BLESSINGS,blessings_excell,33345553434234576543,English,,
"Count Your Blessings","When upon life's billows you are tempest-tossed",when_upon_lifes_billows_you_are_tempest,"Tabernacle Hymns: Number Four: a choice collection of hymns and songs for every religious use",TH41952,50,"Count Your Blessings","Count your blessings","Rev. Johnson Oatman, Jr.","E. O. Excell",,"[When upon life's billows you are tempest-tossed]",blessings_excell,33345553434234576543,English,,
"Count Your Blessings","When upon life's billows you are tempest-tossed",when_upon_lifes_billows_you_are_tempest,"His Fullness Songs",HFS1977,198,"Count Your Blessings","Count your blessings","Rev. Johnson Oatman, Jr., 1856-1926","Edwin O. Excell, 1851-1921",,"[When upon life's billows you are tempest-tossed]",blessings_excell,33345553434234576543,English,,
"Praise God from Whom All Blessings Flow","Praise God from whom all blessings flow",praise_god_from_whom_all_blessings_ken,"Total Praise: songs and other worship resources for every generation",ToPr2011,637,"Praise God from Whom All Blessings Flow",,"Isaac Watts, 1674-1748; William Kethe, d. 1594; Thomas Ken, 1637-1711","John Hatton, c.1710-1793; George Coles, 1792-1858; Roberta Martin, 1912-1969",,"[Praise God from whom all blessings flow]",praise_god_from_whom_all_blessing_martin,13456717651345543213,English,,
"Family Blessings","O happy man, whose soul is fill'd",o_happy_man_whose_soul_is_filled,"Doctor Watts's imitation of the Psalms of David, to which is added a collection of hymns; the whole applied to the state of the Christian Church in general (3rd ed.)",DWIC1786,231b,"Family Blessings",,,,,,,,English,,
"Family Blessings","O happy man, whose soul is fill'd",o_happy_man_whose_soul_is_filled,"Doctor Watts's Imitation of the Psalms of David, corrected and enlarged, to which is added a collection of hymns; the whole applied to the state of the Christian Church in general (2nd ed.)",DWIP1786,246b,"Family Blessings",,,,,,,,English,,
"Family Blessings","O happy man, whose soul is fill'd",o_happy_man_whose_soul_is_filled,"Doctor Watts's Imitation of the Psalms of David: to which is added a collection of hymns; the whole applied to the state of the Christian church in general (3rd. ed.)",DWIP1787,246b,"Family Blessings",,,,,,,,English,,
"Praise God from whom all blessings flow","Praise God, from whom all blessings flow",praise_god_from_whom_all_blessings_ken,"Complete Mission Praise",CMP2000,557,"Praise God from whom all blessings flow",,"Thomas Ken, 1637-1710","Jimmy Owens",,"[Praise God, from whom all blessings flow]",fairhill_owens,5123455654554,English,,
"Family Blessings","O happy man, whose soul is fill'd",o_happy_man_whose_soul_is_filled,"Doctor Watts's Imitation of the Psalms of David: to which is added a collection of hymns; the whole applied to the state of the Christian church in general (4th ed.)",DWI21790,231b,"Family Blessings",,,,,,,,English,,
"Praise for Temporal Blessings; or, common and special Mercies","We bless the Lord, the just, the good",we_bless_the_lord_the_just_the_good,"Doctor Watts's imitation of the Psalms of David, to which is added a collection of hymns; the whole applied to the state of the Christian Church in general (3rd ed.)",DWIC1786,118a,"Praise for Temporal Blessings; or, common and special Mercies",,,,,,,,English,,
"Praise for Temporal Blessings; or, common and special Mercies","We bless the Lord, the just, the good",we_bless_the_lord_the_just_the_good,"Doctor Watts's Imitation of the Psalms of David: to which is added a collection of hymns; the whole applied to the state of the Christian church in general (4th ed.)",DWI21790,118a,"Praise for Temporal Blessings; or, common and special Mercies",,,,,,,,English,,
"Praise for Temporal Blessings; or, common and special Mercies","We bless the Lord, the just, the good",we_bless_the_lord_the_just_the_good,"Doctor Watts's Imitation of the Psalms of David, corrected and enlarged, to which is added a collection of hymns; the whole applied to the state of the Christian Church in general (2nd ed.)",DWIP1786,126a,"Praise for Temporal Blessings; or, common and special Mercies",,,,,,,,English,,
"Praise for Temporal Blessings; or, common and special Mercies","We bless the Lord, the just, the good",we_bless_the_lord_the_just_the_good,"Doctor Watts's Imitation of the Psalms of David: to which is added a collection of hymns; the whole applied to the state of the Christian church in general (3rd. ed.)",DWIP1787,126a,"Praise for Temporal Blessings; or, common and special Mercies",,,,,,,,English,,
"For All the Blessings of the Year","For all the blessings of the year",for_all_the_blessings_of_the_year,"African Methodist Episcopal Church Hymnal",AMEC1984,577,"For All the Blessings of the Year",,"Albert H. Hutchinson","Robert N. Quaile, b. 1867",,OLDBRIDGE,oldbridge_quaile,3333123155542312,English,,
"Praise for the Blessings of Providence and grace","Almighty father, gracious Lord",almighty_father_gracious_lord,"A Selection of Hymns: from the best authors, intended to be an appendix to Dr. Watt's psalms and hymns. (1st Am. ed.)",SHBA1792,XXXVII,"Praise for the Blessings of Providence and grace",,Steele,,8.6.8.6,,,,English,,
"Praise for Temporal Blessings; or, Common and special Mercies","We bless the Lord, the Just, the Good",we_bless_the_lord_the_just_the_good,"The Psalms of David: imitated in the language of the New Testament.",PDIL1740,119a,"Praise for Temporal Blessings; or, Common and special Mercies",,,,,,,,English,,
"The Blessings of Friendship","How pleasant 'tis to see",how_pleasant_tis_to_see,"Doctor Watts's imitation of the Psalms of David, to which is added a collection of hymns; the whole applied to the state of the Christian Church in general (3rd ed.)",DWIC1786,237b,"The Blessings of Friendship",,,,,,,,English,,
"The Blessings of Friendship","How pleasant 'tis to see",how_pleasant_tis_to_see,"Doctor Watts's Imitation of the Psalms of David: to which is added a collection of hymns; the whole applied to the state of the Christian church in general (4th ed.)",DWI21790,237b,"The Blessings of Friendship",,,,,,,,English,,
"Family Blessings","O happy Man, whose Soul is fill'd",o_happy_man_whose_soul_is_filled,"The Psalms of David: imitated in the language of the New Testament.",PDIL1740,241a,"Family Blessings",,,,,,,,English,,
"The Blessings of Friendship","How pleasant 'tis to see",how_pleasant_tis_to_see,"Doctor Watts's Imitation of the Psalms of David, corrected and enlarged, to which is added a collection of hymns; the whole applied to the state of the Christian Church in general (2nd ed.)",DWIP1786,253a,"The Blessings of Friendship",,,,,,,,English,,
"The Blessings of Friendship","How pleasant 'tis to see",how_pleasant_tis_to_see,"Doctor Watts's Imitation of the Psalms of David: to which is added a collection of hymns; the whole applied to the state of the Christian church in general (3rd. ed.)",DWIP1787,253a,"The Blessings of Friendship",,,,,,,,English,,
"Praise God, from Whom All Blessings Flow","Praise God, from whom all blessings flow",praise_god_from_whom_all_blessings_ken,"Psalter Hymnal (Red): doctrinal standards and liturgy of the Christian Reformed Church",PsH1934,468,"Praise God, from Whom All Blessings Flow",,"Bishop Thomas Ken","L. Bourgeois",8.8.8.8,"OLD HUNDREDTH",old_hundredth_bourgeois,117651233332143,English,,
"Praise God, from whom all blessings flow","Praise God, from whom all blessings flow",praise_god_from_whom_all_blessings_f_wh,"A Collection of Psalms and Hymns for Publick Worship",CPHP1789,LXIII,,,,,,,,,English,,
"The Providence of God in Air, Earth and Sea; or The Blessings of Rain","'Tis by thy strength the mountains stand",tis_by_thy_strength_the_mountains_stand,"Doctor Watts's imitation of the Psalms of David, to which is added a collection of hymns; the whole applied to the state of the Christian Church in general (3rd ed.)",DWIC1786,113a,"The Providence of God in Air, Earth and Sea; or The Blessings of Rain",,,,,,,,English,,
"The Blessings of the Spring; or God gives Rain","Good is the Lord, the heavenly King",good_is_the_lord_the_heavenly_king,"Doctor Watts's imitation of the Psalms of David, to which is added a collection of hymns; the whole applied to the state of the Christian Church in general (3rd ed.)",DWIC1786,113b,"The Blessings of the Spring; or God gives Rain",,,,,,,,English,,
"The Providence of God in Air, Earth and Sea; or The Blessings of Rain","'Tis by thy strength the mountains stand",tis_by_thy_strength_the_mountains_stand,"Doctor Watts's Imitation of the Psalms of David: to which is added a collection of hymns; the whole applied to the state of the Christian church in general (4th ed.)",DWI21790,113a,"The Providence of God in Air, Earth and Sea; or The Blessings of Rain",,,,,,,,English,,
"The Blessings of the Spring; or God gives Rain","Good is the Lord, the heavenly King",good_is_the_lord_the_heavenly_king,"Doctor Watts's Imitation of the Psalms of David: to which is added a collection of hymns; the whole applied to the state of the Christian church in general (4th ed.)",DWI21790,113b,"The Blessings of the Spring; or God gives Rain",,,,,,,,English,,
"The Providence of God in Air, Earth and Sea; or The Blessings of Rain","'Tis by thy strength the mountains stand",tis_by_thy_strength_the_mountains_stand,"Doctor Watts's Imitation of the Psalms of David, corrected and enlarged, to which is added a collection of hymns; the whole applied to the state of the Christian Church in general (2nd ed.)",DWIP1786,120b,"The Providence of God in Air, Earth and Sea; or The Blessings of Rain",,,,,,,,English,,
"The Providence of God in Air, Earth and Sea; or The Blessings of Rain","'Tis by thy strength the mountains stand",tis_by_thy_strength_the_mountains_stand,"Doctor Watts's Imitation of the Psalms of David: to which is added a collection of hymns; the whole applied to the state of the Christian church in general (3rd. ed.)",DWIP1787,120b,"The Providence of God in Air, Earth and Sea; or The Blessings of Rain",,,,,,,,English,,
"The Blessings of the Spring; or God gives Rain","Good is the Lord, the heavenly King",good_is_the_lord_the_heavenly_king,"Doctor Watts's Imitation of the Psalms of David, corrected and enlarged, to which is added a collection of hymns; the whole applied to the state of the Christian Church in general (2nd ed.)",DWIP1786,121,"The Blessings of the Spring; or God gives Rain",,,,,,,,English,,
"The Blessings of the Spring; or God gives Rain","Good is the Lord, the heavenly King",good_is_the_lord_the_heavenly_king,"Doctor Watts's Imitation of the Psalms of David: to which is added a collection of hymns; the whole applied to the state of the Christian church in general (3rd. ed.)",DWIP1787,121,"The Blessings of the Spring; or God gives Rain",,,,,,,,English,,
"The Blessings of the liberal Man","That man is blest who stands in awe",that_man_is_blest_who_stands_in_aw_tate,"Doctor Watts's imitation of the Psalms of David, to which is added a collection of hymns; the whole applied to the state of the Christian Church in general (3rd ed.)",DWIC1786,198b,"The Blessings of the liberal Man",,,,,,,,English,,
"The Blessings of the liberal Man","That man is blest who stands in awe",that_man_is_blest_who_stands_in_aw_tate,"Doctor Watts's Imitation of the Psalms of David: to which is added a collection of hymns; the whole applied to the state of the Christian church in general (4th ed.)",DWI21790,198b,"The Blessings of the liberal Man",,,,,,,,English,,
"The Blessings of the Pious and Charitable","Thrice happy man who fears the Lord",thrice_happy_man_who_fears_the_lord,"Doctor Watts's imitation of the Psalms of David, to which is added a collection of hymns; the whole applied to the state of the Christian Church in general (3rd ed.)",DWIC1786,199,"The Blessings of the Pious and Charitable",,,,,,,,English,,
"The Blessings of the Pious and Charitable","Thrice happy man who fears the Lord",thrice_happy_man_who_fears_the_lord,"Doctor Watts's Imitation of the Psalms of David: to which is added a collection of hymns; the whole applied to the state of the Christian church in general (4th ed.)",DWI21790,199,"The Blessings of the Pious and Charitable",,,,,,,,English,,
"The Blessings of the liberal Man","That man is blest who stands in awe",that_man_is_blest_who_stands_in_aw_tate,"Doctor Watts's Imitation of the Psalms of David, corrected and enlarged, to which is added a collection of hymns; the whole applied to the state of the Christian Church in general (2nd ed.)",DWIP1786,211,"The Blessings of the liberal Man",,,,,,,,English,,
"The Blessings of the liberal Man","That man is blest who stands in awe",that_man_is_blest_who_stands_in_aw_tate,"Doctor Watts's Imitation of the Psalms of David: to which is added a collection of hymns; the whole applied to the state of the Christian church in general (3rd. ed.)",DWIP1787,211,"The Blessings of the liberal Man",,,,,,,,English,,
"The Blessings of the Pious and Charitable","Thrice happy man who fears the Lord",thrice_happy_man_who_fears_the_lord,"Doctor Watts's Imitation of the Psalms of David, corrected and enlarged, to which is added a collection of hymns; the whole applied to the state of the Christian Church in general (2nd ed.)",DWIP1786,212a,"The Blessings of the Pious and Charitable",,,,,,,,English,,
"The Blessings of the Pious and Charitable","Thrice happy man who fears the Lord",thrice_happy_man_who_fears_the_lord,"Doctor Watts's Imitation of the Psalms of David: to which is added a collection of hymns; the whole applied to the state of the Christian church in general (3rd. ed.)",DWIP1787,212a,"The Blessings of the Pious and Charitable",,,,,,,,English,,
"Summer and Winter","Let Zion praise the mighty God",let_zion_praise_the_mighty_god,"Doctor Watts's imitation of the Psalms of David, to which is added a collection of hymns; the whole applied to the state of the Christian Church in general (3rd ed.)",DWIC1786,260,"Summer and Winter",,,,,,,,English,,
"Summer and Winter","Let Zion praise the mighty God",let_zion_praise_the_mighty_god,"Doctor Watts's Imitation of the Psalms of David: to which is added a collection of hymns; the whole applied to the state of the Christian church in general (4th ed.)",DWI21790,260,"Summer and Winter",,,,,,,,English,,
"The Seasons of the Year","With songs and honours sounding loud",with_songs_and_honors_sounding_loud,"Doctor Watts's imitation of the Psalms of David, to which is added a collection of hymns; the whole applied to the state of the Christian Church in general (3rd ed.)",DWIC1786,261a,"The Seasons of the Year",,,,,,,,English,,
"The Seasons of the Year","With songs and honours sounding loud",with_songs_and_honors_sounding_loud,"Doctor Watts's Imitation of the Psalms of David: to which is added a collection of hymns; the whole applied to the state of the Christian church in general (4th ed.)",DWI21790,261a,"The Seasons of the Year",,,,,,,,English,,
"Summer and Winter","Let Zion praise the mighty God",let_zion_praise_the_mighty_god,"Doctor Watts's Imitation of the Psalms of David, corrected and enlarged, to which is added a collection of hymns; the whole applied to the state of the Christian Church in general (2nd ed.)",DWIP1786,277,"Summer and Winter",,,,,,,,English,,
"Summer and Winter","Let Zion praise the mighty God",let_zion_praise_the_mighty_god,"Doctor Watts's Imitation of the Psalms of David: to which is added a collection of hymns; the whole applied to the state of the Christian church in general (3rd. ed.)",DWIP1787,277,"Summer and Winter",,,,,,,,English,,
"The Seasons of the Year","With songs and honours sounding loud",with_songs_and_honors_sounding_loud,"Doctor Watts's Imitation of the Psalms of David, corrected and enlarged, to which is added a collection of hymns; the whole applied to the state of the Christian Church in general (2nd ed.)",DWIP1786,278a,"The Seasons of the Year",,,,,,,,English,,
"The Seasons of the Year","With songs and honours sounding loud",with_songs_and_honors_sounding_loud,"Doctor Watts's Imitation of the Psalms of David: to which is added a collection of hymns; the whole applied to the state of the Christian church in general (3rd. ed.)",DWIP1787,278a,"The Seasons of the Year",,,,,,,,English,,
"Lift your voice, and thankful sing","Lift your voice, and thankful sing",lift_your_voice_and_joyful_sing,"A Collection of Psalms and Hymns for Publick Worship",CPHP1789,XXII,,,,,,,,,English,,
"The Blessings of the Spring; or, GOD gives Rain: A Psalm for the Husbandman","Good is the Lord, the heav'nly King",good_is_the_lord_the_heavenly_king,"The Psalms of David: imitated in the language of the New Testament.",PDIL1740,114,"The Blessings of the Spring; or, GOD gives Rain: A Psalm for the Husbandman",,,,,,,,English,,
"Count Your Blessings","When upon life's billows you are tempest-tossed",when_upon_lifes_billows_you_are_tempest,"Praise for the Lord (Expanded Edition)",PFTL1997,118,"Count Your Blessings",,"Johnson Oatman, Jr.","Edwin O. Excell",,"[When upon life's billows you are tempest-tossed]",blessings_excell,33345553434234576543,English,,
"The Warning of God to his People; or Spiritual Blessings and Punishments","Sing to the Lord aloud",sing_to_the_lord_aloud,"Doctor Watts's imitation of the Psalms of David, to which is added a collection of hymns; the whole applied to the state of the Christian Church in general (3rd ed.)",DWIC1786,142a,"The Warning of God to his People; or Spiritual Blessings and Punishments",,,,,,,,English,,
"The Warning of God to his People; or Spiritual Blessings and Punishments","Sing to the Lord aloud",sing_to_the_lord_aloud,"Doctor Watts's Imitation of the Psalms of David: to which is added a collection of hymns; the whole applied to the state of the Christian church in general (4th ed.)",DWI21790,142a,"The Warning of God to his People; or Spiritual Blessings and Punishments",,,,,,,,English,,
"The Warning of God to his People; or Spiritual Blessings and Punishments","Sing to the Lord aloud",sing_to_the_lord_aloud,"Doctor Watts's Imitation of the Psalms of David, corrected and enlarged, to which is added a collection of hymns; the whole applied to the state of the Christian Church in general (2nd ed.)",DWIP1786,151,"The Warning of God to his People; or Spiritual Blessings and Punishments",,,,,,,,English,,
"The Warning of God to his People; or Spiritual Blessings and Punishments","Sing to the Lord aloud",sing_to_the_lord_aloud,"Doctor Watts's Imitation of the Psalms of David: to which is added a collection of hymns; the whole applied to the state of the Christian church in general (3rd. ed.)",DWIP1787,151,"The Warning of God to his People; or Spiritual Blessings and Punishments",,,,,,,,English,,
"The Blessings of the liberal Man","That Man is blest who stands in Awe",that_man_is_blest_who_stands_in_aw_tate,"The Psalms of David: imitated in the language of the New Testament.",PDIL1740,203,"The Blessings of the liberal Man",,,,,,,,English,,
"The Divine Nature, Providence, and Grace","Praise ye the Lord; 'tis good to raise",praise_ye_the_lord_tis_good_to_raise,"Doctor Watts's imitation of the Psalms of David, to which is added a collection of hymns; the whole applied to the state of the Christian Church in general (3rd ed.)",DWIC1786,259,"The Divine Nature, Providence, and Grace",,,,,,,,English,,
"The Divine Nature, Providence, and Grace","Praise ye the Lord; 'tis good to raise",praise_ye_the_lord_tis_good_to_raise,"Doctor Watts's Imitation of the Psalms of David: to which is added a collection of hymns; the whole applied to the state of the Christian church in general (4th ed.)",DWI21790,259,"The Divine Nature, Providence, and Grace",,,,,,,,English,,
"The Divine Nature, Providence, and Grace","Praise ye the Lord; 'tis good to raise",praise_ye_the_lord_tis_good_to_raise,"Doctor Watts's Imitation of the Psalms of David, corrected and enlarged, to which is added a collection of hymns; the whole applied to the state of the Christian Church in general (2nd ed.)",DWIP1786,276,"The Divine Nature, Providence, and Grace",,,,,,,,English,,
"The Divine Nature, Providence, and Grace","Praise ye the Lord; 'tis good to raise",praise_ye_the_lord_tis_good_to_raise,"Doctor Watts's Imitation of the Psalms of David: to which is added a collection of hymns; the whole applied to the state of the Christian church in general (3rd. ed.)",DWIP1787,276,"The Divine Nature, Providence, and Grace",,,,,,,,English,,
"Harvest Blessings","Thou visitest the earth in love",thou_visitest_the_earth_in_love,"The Psalter: with responsive readings",PS1912,169,"Harvest Blessings",,,,,RAMOTH,ramoth_english,511123332345543,English,,
"Invoking divine blessings","Within thy house, O Lord our God",within_thy_house_o_lord_our_god,"Hymnal of the Methodist Episcopal Church",HMEC1891,65,"Invoking divine blessings",,Unknown,,8.6.8.6,,,,English,,
"Psalm 128","O happy man, whose soul is filled",o_happy_man_whose_soul_is_filled,"Psalms and Hymns of Isaac Watts, The",PHW,Ps.296,"Psalm 128",,"Isaac Watts",,8.6.8.6,,,,English,,
"The Warnings of GOD to his People; or, Spiritual Blessings and Punishments","Sing to the Lord aloud",sing_to_the_lord_aloud,"The Psalms of David: imitated in the language of the New Testament.",PDIL1740,143,"The Warnings of GOD to his People; or, Spiritual Blessings and Punishments",,,,,,,,English,,
"The Blessings of Grace","Praise waits in Zion, Lord, for Thee",praise_waits_in_zion_lord_for_theetherew,"The Psalter: with responsive readings",PS1912,172,"The Blessings of Grace",,,"Isaac Smith",8.6.8.6,"ST. STEPHEN",abridge_smith,15117654332365545534,English,,
"Ascension Blessings","O Lord, Thou hast ascended",o_lord_thou_hast_ascended,"The Psalter: with responsive readings",PS1912,183,"Ascension Blessings",,,"Lowell Mason",,"MISSIONARY HYMN",missionary_hymn_mason,135565317143321,English,,
"The Blessings of Friendship","How pleasant 'tis to see",how_pleasant_tis_to_see,"The Psalms of David: imitated in the language of the New Testament.",PDIL1740,247b,"The Blessings of Friendship",,,,,,,,English,,
"O happy man whose soul is fill'd","O happy man whose soul is fill'd",o_happy_man_whose_soul_is_filled,"The Psalms and Hymns of Dr. Watts",PHDW1835,415,,,"Isaac Watts",,8.6.8.6,,,,English,,
"Crosses and blessings","Since all the varying scenes of time",since_all_the_varying_scenes_of_time,"Hymnal of the Methodist Episcopal Church",HMEC1891,615,"Crosses and blessings",,"James Hervey",,8.6.8.6,,,,English,,
Doxology,"Praise God from whom all blessings flow",praise_god_from_whom_all_blessings_ken,"Total Praise: songs and other worship resources for every generation",ToPr2011,638,Doxology,,"Thomas Ken, 1637-1711","Louis Bourgeois, c.1510-1561",,"OLD HUNDREDTH",old_hundredth_bourgeois,117651233332143,English,,"<cite>Genevan Psalter</cite>, 1551"
"Blessings of prayer","What various hindrances we meet",what_various_hindrances_we_meet,"Hymnal of the Methodist Episcopal Church",HMEC1891,690,"Blessings of prayer",,"William Cowper",,8.8.8.8,,,,English,,